program: Gaussian 09
title: 000154121
version: EM64L-G09RevD.01
frameworkgroup: C1[X(C27H20FN5O2)]
method: RPBEPBE
basis: SDD
operation: Freq
keyword: #p
keyword: freq=noraman
keyword: PBEPBE/SDD
title: #p freq=noraman PBEPBE/SDD
converged: YES YES NO NO
title: Mulliken charges:
elementType: F O O N N N N N C C C C C C C C C C C C C C C C C C C C C C C C C C C H H H H H H H H H H H H H H H H H H H H
charge: -0.199849 -0.214857 -0.263201 -0.237808 -0.254429 -0.077168 -0.011177 -0.402217 -0.561271 -0.000449 0.226374 0.237596 0.306085 0.356901 0.199772 -0.370625 0.407417 -0.054776 0.008727 0.202361 0.149007 -0.338020 -0.500530 -0.407685 -0.335324 -0.288549 -0.788726 -0.420780 0.287357 -0.211406 -0.416261 -0.354982 0.107292 -0.596811 -0.490137 0.257227 0.273093 0.282691 0.257360 0.288337 0.277404 0.300956 0.248563 0.237489 0.240110 0.279029 0.252336 0.234993 0.259685 0.244111 0.330632 0.234965 0.278967 0.236952 0.293249
chargesum: 0.00000
title: Mulliken charges with hydrogens summed into heavy atoms:
elementType: F O O N N N N N C C C C C C C C C C C C C C C C C C C C C C C C C C C
charge: -0.199849 -0.214857 -0.263201 -0.237808 -0.254429 -0.077168 -0.011177 -0.071586 -0.030951 -0.000449 0.226374 0.237596 0.306085 0.356901 0.199772 -0.087933 0.407417 -0.054776 0.008727 0.202361 0.149007 -0.080660 -0.212193 -0.130281 -0.034368 -0.039986 -0.032098 -0.168444 0.287357 0.023587 -0.156577 -0.110871 0.107292 0.154074 -0.196888
polarizability: 4.94192353e+02 -3.17031967e+00 3.27871551e+02 3.74321427e+01 1.90084490e+01 2.26733603e+02
1716.lowfreq: -8.7912 -2.5979 -0.0005 0.0003 0.0004 1.2687 9.6315 19.3050 20.1473
frequency: 7.6862 19.3008 20.0613 32.6922 37.1722 44.2877 54.2527 67.0963 81.4423 89.4247 94.3624 106.2496 115.7541 117.8337 142.4555 151.1605 154.9435 174.5009 187.3205 191.0414 206.9018 227.7099 236.6726 246.2842 271.0109 275.0560 293.4928 303.9312 315.8463 333.1438 346.6173 358.7591 375.9781 380.9173 413.6158 421.4836 436.5028 476.7713 491.8094 494.8977 509.4483 524.3558 528.5214 539.7854 551.1725 560.1431 598.1782 605.2007 612.1896 618.3794 623.1896 633.7961 641.4685 645.0983 654.5870 667.9901 678.1698 687.5386 703.2930 717.4635 742.6921 755.6963 768.3101 770.2490 778.3686 781.6757 813.6385 819.5920 824.1546 841.3472 847.3842 854.9000 879.2913 889.1926 906.5840 919.8596 925.9314 943.1293 948.6910 976.7020 985.5467 987.6428 991.9463 1010.1131 1026.3486 1046.0474 1047.7423 1072.8022 1091.1010 1123.3715 1125.3847 1131.8465 1142.1870 1158.8488 1175.8513 1176.8417 1177.9839 1198.2707 1217.0608 1226.2335 1235.5266 1237.3094 1252.4023 1267.8810 1284.6203 1302.5078 1320.4475 1325.6290 1337.1196 1342.5384 1351.6338 1366.2879 1393.6444 1397.4578 1401.4496 1408.8974 1415.2711 1419.7181 1426.7699 1439.1207 1455.8276 1460.1775 1469.2885 1474.6364 1475.8994 1484.9655 1494.1419 1507.5271 1517.2175 1528.0521 1535.9143 1567.9425 1575.7066 1581.6140 1597.2581 1604.4199 1628.3446 1655.8958 2124.2749 2981.7592 2989.0792 3013.4198 3055.7969 3062.0130 3071.9226 3122.0220 3124.1285 3132.1061 3142.0733 3146.3250 3148.7788 3158.9364 3167.8512 3168.9181 3175.1713 3198.2470 3232.5830 3412.0875 3562.6861
redmass: 6.2616 6.2950 5.2745 6.0805 6.3138 5.8329 4.3899 2.9342 1.5155 5.9268 4.6590 5.7015 5.2029 3.5466 4.0673 1.2300 3.5089 4.7409 4.4060 6.3070 5.7794 3.9367 3.9430 5.7810 5.0728 4.7761 2.7815 4.1215 8.1467 5.9975 6.2163 6.6534 5.7487 5.7098 8.0443 2.9441 3.2826 5.5670 6.5404 6.6783 6.3265 4.8992 4.9205 4.1740 4.7779 1.2831 5.0688 4.4427 5.2440 3.6898 2.0592 3.2480 4.6995 4.7710 5.5591 1.2448 5.4792 6.3042 4.2073 8.7416 3.4907 3.8080 2.6034 4.3687 4.0503 4.8016 2.0172 1.3624 1.8860 4.2674 3.1212 1.9940 3.6559 4.9726 1.5008 1.4195 1.3841 1.4287 4.6711 1.6994 1.3267 1.5563 5.1154 2.0937 2.1494 1.5148 3.1994 2.3766 3.0044 4.3557 1.3256 3.7294 1.6150 1.4151 1.5217 1.6145 1.3821 1.9563 3.9420 1.9625 2.5226 3.1052 2.5292 1.5523 1.6343 5.8512 2.6983 4.7496 2.0494 3.0158 3.3063 2.9649 2.3907 1.3213 6.7188 4.8564 3.6542 2.5230 1.1718 2.6572 1.1813 1.2259 1.1169 1.3627 2.4261 1.0511 2.6666 4.2787 1.7380 3.9618 7.6312 7.9162 7.7285 7.8329 7.1178 7.9165 7.5316 9.0224 6.2409 1.0398 1.0351 1.0596 1.0979 1.1023 1.1028 1.0988 1.0961 1.0882 1.0889 1.0875 1.0927 1.0980 1.0954 1.0952 1.0930 1.0961 1.0978 1.1568 1.0776
irintensity: 0.8671 0.6576 0.0401 2.9840 1.8246 1.1109 4.8160 1.4750 0.5563 6.3818 0.9742 3.3196 0.4412 2.8790 0.7159 0.3178 0.7543 2.8571 1.9167 3.1586 0.3429 4.2459 5.0264 0.9104 4.8396 2.0032 2.1003 5.2923 0.1459 4.4096 12.6230 19.0957 2.7919 1.5198 8.3326 4.9805 7.1483 1.2523 0.7100 6.5454 10.4787 2.2452 2.3626 0.4686 11.8436 102.5620 5.3063 12.0455 3.6159 28.1533 27.0931 25.1076 7.7325 4.4392 1.0096 44.2176 6.4111 11.3743 6.3712 8.5716 7.8209 9.1798 36.1829 22.0342 18.5565 0.2615 65.7228 59.9931 13.8954 3.6113 34.7474 13.0565 23.9807 5.8044 22.0151 4.1911 0.5406 1.3049 27.6533 5.8485 1.8075 7.4143 28.7670 13.3539 0.9938 1.8817 35.4697 8.0907 111.1458 0.7349 0.3315 0.7298 58.9727 4.5434 28.6264 31.2039 24.2070 166.3037 13.7866 12.2898 388.9679 59.5905 296.6365 68.4066 36.7176 41.4822 33.4925 36.4376 20.4314 19.2619 66.1774 33.7597 10.6999 17.4144 15.5975 22.0913 78.7240 4.1446 32.7393 63.0041 13.8079 202.5665 25.2531 5.8414 25.6673 23.7691 2.1557 34.9008 328.5147 268.3992 166.7663 25.8004 4.6671 11.3728 11.7295 28.9041 5.1254 185.8742 3.3831 19.9030 77.7823 12.7669 14.5544 1.8304 28.1772 1.6202 5.9540 8.3110 6.5546 7.8047 20.8099 16.4566 12.0889 2.7187 0.6727 3.4268 2.9701 101.2829 22.1703
temp: 298.150 k
press: 1.00000 atm
elementType: 9 8 8 7 7 7 7 7 6 6 6 6 6 6 6 6 6 6 6 6 6 6 6 6 6 6 6 6 6 6 6 6 6 6 6 1 1 1 1 1 1 1 1 1 1 1 1 1 1 1 1 1 1 1 1
symmnumber: 1
zpe: 1076209.7 jmol-1
zpe.correction: 0.409907 hartree
zpe.thermalcorrener: 0.440529 hartree
zpe.thermalcorrenthalpy: 0.441473 hartree
zpe.thermalcorrgfe: 0.344705 hartree
zpe.sumelectzpe: -1562.486463 hartree
zpe.sumelectthermal: -1562.455841 hartree
zpe.sumelectthermalent: -1562.454897 hartree
zpe.sumelectthermalfe: -1562.551664 hartree
dipole: 5.5735 -4.4309 1.9379
dipole: 7.3792
quadrupole: -199.9081 -193.2475 -210.9855
quadrupole: 6.1358 -26.8948 1.4877
quadrupole: 1.4722 8.1329 -9.6051 6.1358 -26.8948 1.4877
hfenergy: -1562.8963694 hartree
pointgroup: C01 [X(C27H20F1N5O2)]
dipole: -2.0043336 -1.8431743 -1.0069377 debye
polarizability: 476.9514241|13.2255549|326.9638864|74.9077038|-19.3848458|244.8821973 unknown
InChI: InChI=1S/C27H20FN5O2/c1-4-17-6-5-7-24-25(17)20(15-33(24)27(35)29-3)26(34)18-8-9-19(21(28)12-18)14-32-16(2)31-22-13-30-11-10-23(22)32/h1,5-13,15,29H,14H2,2-3H3
charge 0 multiplicity 1
55 atoms
F  1.577959 -0.655948 -2.762857
O  -1.980023 -2.237776 1.835233
O  -6.770169 -0.131153 -2.121315
N  4.788443 -0.729481 -0.091302
N  -4.88323 -0.46796 -0.740374
N  6.492072 -0.746064 1.447019
N  5.483092 2.865866 1.922712
N  -6.850284 -1.746854 -0.43166
C  3.829899 -1.195381 -1.100859
C  -2.893121 0.644783 -0.376784
C  -2.801535 -0.700523 0.194767
C  -4.194048 0.753814 -0.9813
C  2.400338 -1.274051 -0.571487
C  4.831801 0.562399 0.448573
C  5.810266 -1.477449 0.548694
C  -4.031901 -1.318517 -0.025879
C  -0.302347 -1.364773 0.351663
C  -1.709321 -1.452853 0.869434
C  5.900272 0.537775 1.404898
C  -2.047212 1.802545 -0.361489
C  1.306332 -0.993647 -1.414151
C  2.100581 -1.628372 0.768867
C  -0.027893 -1.016242 -0.993377
C  0.77039 -1.691694 1.221395
C  -4.649212 1.913407 -1.640276
C  4.08295 1.735441 0.22364
C  6.086269 -2.915257 0.231825
C  -2.50908 2.969722 -1.029937
C  -6.232996 -0.755021 -1.167266
C  -3.772764 3.017371 -1.666757
C  6.191841 1.719508 2.123502
C  4.464359 2.856253 0.995837
C  -0.797824 1.861786 0.341655
C  -8.199362 -2.219896 -0.771236
C  0.263582 1.993492 0.960054
H  4.159863 -2.190566 -1.448915
H  3.864457 -0.527496 -1.980069
H  -4.298024 -2.3443 0.219203
H  2.924269 -1.837745 1.459949
H  -0.826609 -0.770085 -1.698345
H  0.536304 -1.9764 2.251519
H  -5.63199 1.938888 -2.113752
H  3.260291 1.799318 -0.49534
H  5.204281 -3.560255 0.404459
H  6.40574 -3.055437 -0.818048
H  6.900463 -3.258737 0.886937
H  -1.865802 3.855213 -1.02956
H  -4.082735 3.936245 -2.174786
H  6.997735 1.752403 2.863781
H  3.936292 3.808946 0.875121
H  -6.419454 -2.082226 0.430536
H  -8.206108 -3.315066 -0.914519
H  -8.504952 -1.730813 -1.708836
H  -8.926025 -1.953051 0.01761
H  1.187384 2.075214 1.505191
