program: Gaussian 09
title: 000154106
version: EM64L-G09RevD.01
frameworkgroup: C1[X(C26H29NO3)]
method: RPBEPBE
basis: SDD
operation: Freq
keyword: #p
keyword: freq=noraman
keyword: PBEPBE/SDD
title: #p freq=noraman PBEPBE/SDD
converged: YES YES NO NO
title: Mulliken charges:
elementType: O O O N C C C C C C C C C C C C C C C C C C C C C C C C C C H H H H H H H H H H H H H H H H H H H H H H H H H H H H H
charge: -0.468580 -0.267411 -0.432174 -0.095761 0.262854 0.072715 -0.271975 0.277053 0.252371 0.296677 -0.723819 -0.371704 -0.425520 0.338201 -0.368517 -0.381539 -0.395489 -0.424799 -0.379495 -0.368950 -0.381049 -0.284711 -0.357978 -0.396538 -0.231767 -0.231572 0.273843 -0.249817 -0.613545 -0.614117 0.252913 0.202412 0.219584 0.255974 0.255958 0.244979 0.266680 0.251142 0.246796 0.304991 0.249316 0.249282 0.202740 0.225309 0.205515 0.223933 0.336630 0.250918 0.216396 0.221805 0.220774 0.223705 0.219324 0.193223 0.227048 0.222596 0.191105 0.229370 0.352697
chargesum: 0.00000
title: Mulliken charges with hydrogens summed into heavy atoms:
elementType: O O O N C C C C C C C C C C C C C C C C C C C C C C C C C C
charge: -0.131950 -0.267411 -0.079478 -0.095761 0.262854 0.072715 -0.019062 0.277053 0.252371 0.296677 -0.045850 -0.115746 -0.180542 0.338201 -0.101837 -0.130396 -0.148692 -0.119808 -0.130179 -0.119668 0.047000 0.144736 -0.107060 -0.180142 -0.009962 -0.010798 0.273843 -0.026112 0.026049 0.028953
polarizability: 4.44821750e+02 -1.15354282e+01 3.15001121e+02 2.22559791e+00 6.57138396e+00 2.21826446e+02
1716.lowfreq: -3.8769 -0.9263 -0.0007 -0.0004 0.0006 2.7726 11.7105 15.0875 25.6358
frequency: 9.9550 15.0650 25.5941 38.4030 40.1172 48.5734 54.4226 56.5650 68.6953 70.9161 86.2869 98.7865 127.7206 130.5501 150.8720 159.9308 176.6791 189.7404 197.2107 211.3449 218.3949 224.2651 234.5378 244.6082 255.3946 271.0338 287.6096 301.9692 326.7837 349.9779 355.0657 369.2229 394.8679 397.9522 408.3925 412.8845 415.8813 426.5757 435.2585 464.7328 488.5946 512.3159 519.2697 532.2058 568.2735 582.3460 607.4833 615.3603 632.3956 635.2328 668.1544 696.0584 707.5167 724.0315 746.6876 762.7537 778.8963 783.2257 804.7357 808.5969 813.8053 828.3331 831.9199 839.5735 841.2899 848.7336 860.2206 892.9589 929.8640 938.2247 947.2166 963.9385 969.6261 971.8928 977.8693 983.9336 988.4494 998.8462 1002.7072 1005.8725 1025.5173 1033.4844 1034.8687 1039.2895 1058.8771 1062.0882 1081.1136 1088.0030 1094.5380 1094.7530 1105.9031 1115.2786 1139.1220 1144.4455 1166.8886 1168.7490 1171.4119 1179.0281 1183.5133 1190.7738 1205.7579 1226.6468 1248.4866 1248.8338 1268.8270 1276.3815 1292.5710 1296.3343 1304.9308 1309.9086 1315.3510 1321.1655 1331.7393 1356.7097 1366.6644 1369.5586 1379.8859 1383.3679 1391.3181 1416.9367 1419.6002 1423.3918 1430.4926 1442.9414 1460.3115 1463.4726 1468.2285 1471.2907 1471.8004 1476.4764 1476.7944 1483.9977 1486.2678 1495.5007 1499.2495 1566.9644 1570.8090 1581.3923 1591.0739 1604.8462 1615.0730 1619.3913 2854.9631 2864.6201 2892.6305 2968.4596 2973.0515 3019.2411 3021.3355 3027.2127 3031.0153 3057.8590 3061.8468 3080.1587 3084.5194 3096.0541 3109.5451 3118.1226 3126.6100 3127.4041 3139.9143 3141.9745 3145.5015 3152.7749 3156.7547 3159.4351 3166.5341 3173.8711 3174.2887 3540.6375 3578.8454
redmass: 2.6115 4.6657 4.9420 4.2254 5.7039 4.6341 4.0329 3.6633 4.1422 3.6585 3.5871 3.3607 4.4460 2.3012 5.0659 4.8984 4.7719 1.8437 1.6095 2.5156 1.0803 3.1070 1.4712 1.6449 2.7804 4.0244 4.2525 4.7130 5.3897 2.7195 5.2384 1.1220 3.3471 3.1260 2.8998 2.9842 3.0254 3.0340 2.7042 3.3277 4.0261 3.3244 3.4997 3.6892 5.1041 3.9468 4.8565 6.3755 6.7827 6.7743 4.5062 4.7898 1.7130 4.1667 4.0341 2.9745 4.1791 3.4270 1.5757 1.4109 2.9695 1.4690 2.3060 1.9791 1.6600 2.3891 1.2558 4.1165 1.4366 1.3629 1.4253 2.0952 1.3696 1.4414 6.9183 1.3950 5.3516 1.3425 2.8226 2.4718 2.6067 2.1522 1.5891 2.2915 1.6865 1.5873 1.6805 1.3897 2.2722 2.3381 1.4708 1.3410 1.4435 1.3937 1.4242 1.3799 1.5981 1.2428 1.2001 1.1376 1.4714 3.0132 2.4165 1.7867 2.5129 3.3589 1.2098 1.6924 1.4954 1.3500 1.2767 1.7392 1.3814 3.8796 5.8529 1.6477 3.9000 1.2395 1.4424 3.8270 1.1441 3.4751 2.3277 1.1635 1.0478 1.0468 1.0649 1.0833 1.1098 1.4826 1.3660 1.1545 1.0572 2.2470 2.5472 7.2027 6.5078 6.7308 7.4777 6.0083 6.3238 6.3458 1.0566 1.0576 1.0690 1.0561 1.0380 1.0848 1.0734 1.0763 1.0966 1.0969 1.0971 1.1007 1.1007 1.0988 1.0887 1.0843 1.0886 1.0886 1.0884 1.0941 1.0947 1.0881 1.0991 1.0941 1.0964 1.0960 1.0968 1.0659 1.0659
irintensity: 0.3724 0.1070 0.1699 0.2381 0.4992 0.3825 0.3984 0.6925 0.6870 1.5545 2.0025 1.3720 2.0334 1.7462 1.1781 3.5493 1.3076 25.2710 75.5533 13.7763 1.3511 0.4915 0.7490 3.0704 1.2714 5.0086 0.7974 4.7577 3.4049 9.5804 7.2387 134.2855 5.0194 5.9453 1.1093 0.3071 0.7049 2.5213 1.3583 10.3409 8.1016 10.4062 11.6223 22.1838 5.8270 15.8920 42.2874 0.9723 2.9458 1.3951 6.7791 4.5742 59.1687 0.3077 10.3715 24.0655 25.1733 25.5370 24.5161 36.6894 19.1416 0.9607 14.4262 11.1772 39.6721 28.6842 0.2354 17.7927 5.0636 1.4994 0.7655 5.0563 3.6253 2.9915 112.0716 0.1028 0.2283 2.8609 1.8889 12.8605 12.4467 79.6912 15.0084 28.4307 47.2320 4.9925 20.3895 16.5589 3.1090 7.7526 75.6993 12.8239 2.9742 257.9606 18.7240 13.0607 15.2588 91.5161 28.5370 3.0364 18.6127 301.9415 33.7423 6.0100 18.7275 44.5067 2.3739 8.4424 3.9520 8.6310 9.3832 22.4787 3.3879 47.2611 1.5424 11.2658 13.5604 26.6396 1.6127 7.8618 3.7979 1.5297 8.1059 4.6851 8.9971 3.4892 4.6936 7.9452 43.1633 20.3724 3.4312 76.6163 6.8555 63.4398 134.8274 9.6055 6.1382 18.6658 22.5173 15.0692 124.1373 60.4127 69.5421 179.4765 106.3199 35.2602 32.8270 22.3652 39.3869 47.6086 14.0542 34.8296 38.3293 32.5737 60.7789 25.8940 24.0157 2.3105 14.3723 10.1744 9.1134 36.4765 11.6539 3.6372 28.8308 16.2791 6.7635 15.4296 2.3635 3.7009 51.0092
temp: 298.150 k
press: 1.00000 atm
elementType: 8 8 8 7 6 6 6 6 6 6 6 6 6 6 6 6 6 6 6 6 6 6 6 6 6 6 6 6 6 6 1 1 1 1 1 1 1 1 1 1 1 1 1 1 1 1 1 1 1 1 1 1 1 1 1 1 1 1 1
symmnumber: 1
zpe: 1268136.2 jmol-1
zpe.correction: 0.483008 hartree
zpe.thermalcorrener: 0.512985 hartree
zpe.thermalcorrenthalpy: 0.513929 hartree
zpe.thermalcorrgfe: 0.418662 hartree
zpe.sumelectzpe: -1286.349445 hartree
zpe.sumelectthermal: -1286.319468 hartree
zpe.sumelectthermalent: -1286.318524 hartree
zpe.sumelectthermalfe: -1286.413791 hartree
dipole: -4.3703 -0.1764 2.5836
dipole: 5.0799
quadrupole: -161.0103 -161.0120 -175.0317
quadrupole: -3.3082 0.1659 9.3264
quadrupole: 4.6744 4.6727 -9.3470 -3.3082 0.1659 9.3264
hfenergy: -1286.8324529 hartree
pointgroup: C01 [X(C26H29N1O3)]
dipole: 1.6978814 0.0020444 1.054306 debye
polarizability: 443.7319077|-16.3915852|316.0990003|2.4229725|-6.7960389|221.8184088 unknown
InChI: InChI=1S/C26H29NO3/c1-19(28)25(20-7-5-4-6-8-20)26(21-9-13-23(29)14-10-21)22-11-15-24(16-12-22)30-18-17-27(2)3/h4-16,19,28-29H,17-18H2,1-3H3
charge 0 multiplicity 1
59 atoms
O  -1.510044 3.147436 -1.901472
O  4.565973 -0.668387 -0.66558
O  -4.073616 -4.772554 -0.117493
N  7.941082 0.09066 0.741263
C  -1.718672 1.405714 -0.230991
C  -1.112947 0.159056 -0.241975
C  -0.933494 2.664206 -0.606777
C  0.374076 -0.012401 -0.34197
C  -3.149357 1.60226 0.175496
C  -1.892012 -1.120071 -0.177645
C  -0.988286 3.784512 0.451991
C  0.944937 -0.876216 -1.321309
C  1.258266 0.627896 0.564589
C  3.198981 -0.405486 -0.499448
C  -3.092927 -1.299582 -0.923174
C  -1.416619 -2.221429 0.584668
C  -3.61093 1.047081 1.403799
C  -4.060828 2.381255 -0.592368
C  2.333666 -1.06423 -1.410743
C  2.657513 0.441005 0.499501
C  6.912961 -0.46275 -0.170689
C  5.509226 -0.014575 0.259144
C  -3.800633 -2.513472 -0.89541
C  -2.121706 -3.441759 0.633399
C  -4.936192 1.247413 1.842596
C  -5.389245 2.578087 -0.153219
C  -3.318961 -3.585468 -0.108208
C  -5.835918 2.013088 1.06376
C  8.067007 -0.668035 2.003451
C  9.25105 0.284018 0.086523
H  0.118906 2.385497 -0.79551
H  -0.393187 4.660534 0.126883
H  -0.570578 3.435816 1.41426
H  -2.027902 4.109452 0.627558
H  0.283986 -1.394483 -2.024309
H  0.84279 1.26362 1.355388
H  -3.464817 -0.475888 -1.539837
H  -0.484234 -2.119534 1.150599
H  -2.918584 0.455053 2.01267
H  -3.710745 2.813799 -1.533199
H  2.7724 -1.715579 -2.172897
H  3.302303 0.947768 1.223677
H  6.939286 -1.578325 -0.227112
H  7.098528 -0.083055 -1.191183
H  5.283834 -0.323626 1.29991
H  5.423143 1.086981 0.186506
H  -1.109769 4.032818 -2.101287
H  -4.718359 -2.651321 -1.474481
H  -1.738888 -4.274013 1.239085
H  -5.266759 0.80883 2.791264
H  -6.077996 3.171719 -0.765983
H  -6.867256 2.167037 1.401431
H  7.089744 -0.740098 2.511257
H  8.452637 -1.708332 1.851429
H  8.759442 -0.14145 2.6841
H  9.94109 0.790265 0.785608
H  9.733888 -0.672511 -0.237741
H  9.134495 0.929021 -0.801934
H  -3.654649 -5.45857 0.45944
