program: Gaussian 09
title: 000154094
version: EM64L-G09RevD.01
frameworkgroup: C1[X(C24H24BrNO)]
method: RPBEPBE
basis: SDD
operation: Freq
keyword: #p
keyword: freq=noraman
keyword: PBEPBE/SDD
title: #p freq=noraman PBEPBE/SDD
converged: YES YES NO NO
title: Mulliken charges:
elementType: Br O N C C C C C C C C C C C C C C C C C C C C C C C C H H H H H H H H H H H H H H H H H H H H H H H H
charge: -0.000536 -0.266534 -0.096075 0.367745 0.269011 -0.382592 -0.284492 0.263523 0.343565 -0.358188 -0.385906 -0.553584 -0.381755 -0.356005 0.446864 -0.399200 -0.388401 -0.613725 -0.614717 -0.229015 -0.229215 -0.385760 -0.364641 -0.247083 -0.227244 -0.231786 -0.240907 0.224400 0.204236 0.209161 0.223322 0.251556 0.261658 0.249422 0.250333 0.255524 0.255359 0.220771 0.193513 0.226921 0.222528 0.191060 0.229014 0.226446 0.227599 0.254985 0.254275 0.228461 0.228658 0.228156 0.229296
chargesum: 0.00000
title: Mulliken charges with hydrogens summed into heavy atoms:
elementType: Br O N C C C C C C C C C C C C C C C C C C C C C C C C
charge: -0.000536 -0.266534 -0.096075 0.367745 0.269011 0.046044 0.147991 0.263523 0.343565 -0.106632 -0.124248 -0.553584 -0.132333 -0.105672 0.446864 -0.143677 -0.133042 0.027481 0.027885 -0.002569 -0.001617 -0.130775 -0.110366 -0.018622 0.001413 -0.003629 -0.011611
polarizability: 4.43981633e+02 -7.45312407e+00 2.98389545e+02 2.61566497e+00 7.82228467e+00 1.98761149e+02
1716.lowfreq: -8.0459 -2.9336 -0.0009 -0.0006 0.0003 3.3803 15.4929 21.4782 28.8337
frequency: 15.4336 21.4295 28.8106 41.3042 47.6821 51.7751 52.7063 63.5425 67.9513 80.2414 99.9915 104.9723 135.4009 159.3884 173.8489 178.2530 200.0901 210.2421 221.2719 233.7053 248.0158 261.6628 281.2161 305.6259 339.4590 356.5043 391.7075 402.1863 405.4874 414.6635 422.2305 434.9054 482.9972 502.6015 509.2009 534.9057 561.8740 606.1877 612.1967 617.5038 625.7301 629.9336 669.4237 695.8141 701.7264 726.2898 739.0474 773.0721 779.0687 789.6196 808.1552 823.0427 831.6423 841.7028 844.1162 851.5088 853.9698 919.5600 927.9410 939.0540 955.6905 967.1678 975.2865 979.3328 980.0522 987.7502 989.2690 995.5792 995.9292 1004.2181 1026.6232 1028.7839 1034.0625 1036.0416 1062.3338 1082.0673 1084.7023 1090.8766 1095.5563 1117.7030 1138.5643 1147.0485 1165.3819 1172.1046 1172.7555 1181.0953 1190.5759 1192.2297 1229.1142 1235.8559 1249.7644 1268.8687 1277.3600 1294.0627 1305.5036 1314.4057 1318.5658 1331.3606 1358.0054 1370.3953 1374.7253 1390.0601 1420.1712 1422.7952 1431.2100 1432.2773 1443.4103 1462.3773 1468.5968 1470.7425 1472.8381 1476.7035 1477.6971 1483.6885 1486.2709 1498.7274 1569.3776 1571.1380 1578.7259 1586.5617 1602.7719 1605.7373 1617.7881 2855.2591 2865.1912 2895.9200 2970.2562 3021.1083 3026.9594 3032.2026 3057.8206 3080.1761 3084.4924 3123.4618 3125.9833 3131.6649 3135.0138 3138.6830 3142.6766 3144.2949 3147.5523 3153.1006 3156.6062 3164.4175 3165.5749 3167.8358 3168.4892
redmass: 5.4911 6.2719 4.0637 3.0095 4.5620 4.3519 4.0243 4.5383 3.8298 5.1909 3.2173 5.0525 2.4967 7.4200 4.7958 4.6170 3.4325 3.3037 1.0980 2.1670 3.0814 3.7760 4.5806 4.2065 4.1003 3.5189 3.0175 2.8402 2.8750 3.0180 3.3069 2.8678 3.8532 3.7947 3.7555 3.4016 6.7595 5.2579 6.0776 6.2310 6.5768 6.9401 5.5691 1.9395 1.7311 3.1503 3.4636 2.0138 4.3131 2.9608 1.2812 2.0775 1.6611 2.0308 3.4297 1.2586 1.2602 1.9620 1.4157 2.1540 1.6337 1.3578 7.7075 1.4408 1.3885 5.6821 5.7076 1.3170 1.3258 2.6555 2.2762 2.0868 2.2376 1.5286 1.6170 1.6155 1.6103 1.5887 1.9126 1.3586 1.4354 3.2336 1.4106 1.0535 1.0529 1.2864 1.1128 1.1273 2.6852 4.3399 1.8139 2.5036 3.5780 1.2176 1.3459 1.3715 1.4047 1.3827 4.5589 6.4835 6.1859 1.4458 3.9124 1.1429 2.3108 2.3038 1.1612 1.0487 1.0734 1.3525 1.5833 1.0572 2.2278 1.1269 1.0567 2.2990 7.4482 7.0594 5.8861 7.5781 5.9892 6.1621 6.4076 1.0566 1.0575 1.0690 1.0561 1.0730 1.0746 1.0980 1.0981 1.1008 1.1006 1.0845 1.0846 1.0878 1.0879 1.0887 1.0879 1.0926 1.0926 1.0962 1.0963 1.0954 1.1013 1.1012 1.0966
irintensity: 0.3206 0.2527 0.2423 0.4013 0.1643 0.0865 0.0573 0.1482 0.3119 0.1409 0.7024 0.5172 3.5229 0.3912 1.4454 0.1800 0.5390 1.1536 0.9828 0.7428 4.5889 1.0488 0.8440 1.3912 3.2235 10.5378 1.6955 0.2188 0.4247 1.1809 2.6163 2.0613 5.8393 3.1301 2.6739 4.1215 57.6962 25.2451 2.5655 3.8433 3.4120 15.8377 3.0781 38.8552 48.4177 45.2165 37.4849 15.4231 33.8493 34.7723 14.1328 4.5728 5.1664 25.7480 16.2392 0.7324 0.9546 7.6725 1.6529 13.8726 3.6067 2.0924 123.0834 0.6490 0.5365 0.5972 0.4797 0.2984 0.5855 10.6231 10.5717 7.9067 73.8103 15.9863 6.8563 0.7629 13.3292 16.9414 6.4435 12.6428 3.0100 8.8600 18.3031 0.1397 0.0674 165.2876 1.6269 0.2315 189.7319 133.6451 7.0220 20.0797 35.5900 2.3217 0.6302 0.2983 6.1484 2.1249 18.9172 2.6256 0.2334 2.0884 3.6602 3.8512 1.4349 18.6393 5.6953 9.4443 6.1020 29.8953 13.5850 10.4705 15.5716 62.1189 6.8881 125.4948 7.8968 13.6696 3.7461 20.3668 3.9818 12.1730 134.7963 71.5720 186.2277 101.6676 35.0983 39.0163 49.3207 10.2807 37.2295 31.5499 60.7652 1.2078 1.1854 2.6740 4.0947 7.3132 14.3471 20.8912 19.0073 30.9910 26.7501 14.4744 21.1957 25.8505 2.6909
temp: 298.150 k
press: 1.00000 atm
elementType: 35 8 7 6 6 6 6 6 6 6 6 6 6 6 6 6 6 6 6 6 6 6 6 6 6 6 6 1 1 1 1 1 1 1 1 1 1 1 1 1 1 1 1 1 1 1 1 1 1 1 1
symmnumber: 1
zpe: 1078737.1 jmol-1
zpe.correction: 0.410869 hartree
zpe.thermalcorrener: 0.436883 hartree
zpe.thermalcorrenthalpy: 0.437827 hartree
zpe.thermalcorrgfe: 0.350698 hartree
zpe.sumelectzpe: -1070.415756 hartree
zpe.sumelectthermal: -1070.389743 hartree
zpe.sumelectthermalent: -1070.388799 hartree
zpe.sumelectthermalfe: -1070.475928 hartree
dipole: -0.9493 1.2509 0.8516
dipole: 1.7864
quadrupole: -128.6873 -164.3007 -166.5598
quadrupole: 6.1661 -1.8144 2.2979
quadrupole: 24.4953 -11.1181 -13.3772 6.1661 -1.8144 2.2979
hfenergy: -1070.8266257 hartree
pointgroup: C01 [X(C24H24Br1N1O1)]
dipole: 0.3524092 -0.5410938 0.2774387 debye
polarizability: 443.552994|-10.4385388|299.0461035|4.8157221|5.5489152|198.5332301 unknown
InChI: InChI=1S/C24H24BrNO/c1-26(2)17-18-27-22-15-13-20(14-16-22)23(19-9-5-3-6-10-19)24(25)21-11-7-4-8-12-21/h3-16H,17-18H2,1-2H3
charge 0 multiplicity 1
51 atoms
Br -1.111956 2.906735 -0.261956
O  4.340871 -0.570274 -0.565389
N  7.636931 0.321703 0.946995
C  -1.366621 -0.018585 -0.266149
C  0.123525 -0.116364 -0.324043
C  6.66142 -0.309189 0.027712
C  5.226025 0.040547 0.443877
C  -2.113107 -1.313179 -0.444421
C  2.959825 -0.386633 -0.42062
C  0.756306 -0.849212 -1.368713
C  0.947049 0.45502 0.679364
C  -2.063788 1.155704 -0.088193
C  2.153689 -0.976667 -1.427039
C  2.350991 0.324449 0.644587
C  -3.495745 1.317775 0.268479
C  -1.664793 -2.489624 0.217818
C  -3.236582 -1.409519 -1.310713
C  7.894488 1.743126 0.635001
C  8.890167 -0.447592 1.082697
C  -2.338699 -3.717453 0.043609
C  -3.904476 -2.638617 -1.491424
C  -4.042605 0.535514 1.325869
C  -4.341649 2.247023 -0.397502
C  -3.463621 -3.797791 -0.810489
C  -5.39934 0.663844 1.68776
C  -5.699317 2.3704 -0.036818
C  -6.235863 1.578715 1.006348
H  6.778465 -1.406442 0.078444
H  6.816281 -0.013068 -1.038105
H  5.063513 1.136935 0.46489
H  5.011569 -0.372608 1.448408
H  0.140934 -1.314444 -2.14639
H  0.484498 1.004445 1.50567
H  2.642643 -1.525011 -2.23789
H  2.950493 0.771111 1.443153
H  -0.786774 -2.435321 0.870769
H  -3.576693 -0.518334 -1.848192
H  6.948029 2.310016 0.605472
H  8.41265 1.887816 -0.346979
H  8.525844 2.187321 1.425101
H  9.528316 0.021722 1.853189
H  9.485018 -0.506179 0.136038
H  8.664153 -1.47749 1.410461
H  -1.984112 -4.610856 0.56989
H  -4.765512 -2.693491 -2.166942
H  -3.39571 -0.169392 1.857838
H  -3.927761 2.872185 -1.195853
H  -3.983579 -4.752117 -0.950876
H  -5.80177 0.055669 2.505482
H  -6.338128 3.086252 -0.56599
H  -7.289193 1.680828 1.290466
