program: Gaussian 09
title: 000154083
version: EM64L-G09RevD.01
frameworkgroup: C1[X(C12H5Br5O)]
method: RPBEPBE
basis: SDD
operation: Freq
keyword: #p
keyword: freq=noraman
keyword: PBEPBE/SDD
title: #p freq=noraman PBEPBE/SDD
converged: NO NO NO NO
title: Mulliken charges:
elementType: Br Br Br Br Br O C C C C C C C C C C C C H H H H H
charge: 0.091292 0.091302 0.063094 0.057818 0.027529 -0.265320 0.524498 0.497318 -0.342364 -0.342371 -0.393471 -0.275169 -0.151028 -0.151004 -0.235267 -0.132316 -0.180578 -0.236769 0.264481 0.279384 0.279376 0.274156 0.255408
chargesum: 0.00000
title: Mulliken charges with hydrogens summed into heavy atoms:
elementType: Br Br Br Br Br O C C C C C C C C C C C C
charge: 0.091292 0.091302 0.063094 0.057818 0.027529 -0.265320 0.524498 0.497318 -0.342364 -0.342371 -0.393471 -0.010688 0.128356 0.128372 -0.235267 0.141840 0.074830 -0.236769
polarizability: 3.04977659e+02 4.52989652e-02 1.77741891e+02 1.12632679e+01 2.33013571e-02 1.77715653e+02
1716.lowfreq: -2.6209 0.0004 0.0004 0.0005 1.8845 3.1575 10.8008 15.5333 20.9403
frequency: 10.7958 15.5165 20.9388 59.2028 78.0752 82.9981 111.5506 117.0559 121.1080 145.8906 151.6458 179.6407 222.5280 229.8240 254.5326 283.0676 314.3195 326.1321 349.5470 364.6142 434.4910 469.5105 501.4147 519.5051 540.8861 544.7537 613.1002 639.2971 681.3829 697.3556 713.0082 736.4889 774.8084 808.5909 857.4983 865.8819 876.0713 876.2205 942.3857 1013.4054 1033.3629 1072.2860 1092.5159 1144.5279 1187.2004 1189.4219 1235.2264 1251.3753 1335.1647 1353.5536 1356.0790 1375.4509 1405.6153 1445.9262 1537.7045 1551.4620 1566.2728 1583.8364 3150.8429 3175.6512 3177.9396 3183.1719 3185.1020
redmass: 35.7051 26.1262 45.7271 27.6618 7.6278 64.1136 40.5500 11.1230 33.4867 5.2438 21.6537 4.6297 72.1389 12.5671 11.4155 13.8167 8.4825 9.2384 7.8153 8.2035 3.1595 7.0978 5.0307 7.4428 5.5704 4.3499 5.3892 6.9648 10.5128 4.0057 10.0671 8.1581 8.2034 1.4108 7.2017 1.4334 1.3675 1.4024 1.3488 5.7887 5.7410 2.3762 2.5848 1.3333 1.5873 2.8470 3.5205 1.3706 5.2121 4.4523 4.1251 5.5127 3.2771 2.5109 9.5106 7.9075 7.7673 7.9424 1.0888 1.0941 1.0954 1.0931 1.0939
irintensity: 0.0050 0.0109 0.0025 0.0394 0.3838 0.0525 0.0002 0.0248 0.0330 0.4507 0.0988 0.0098 0.0466 0.7150 0.6245 3.6035 0.2154 2.1064 4.5749 4.6156 5.9335 2.6097 0.0133 7.2889 24.7370 4.2411 3.6492 15.1821 53.4722 11.3417 53.5289 44.8042 13.5901 40.8665 0.3646 29.0279 0.7271 13.2322 0.0033 109.6733 45.7220 28.0341 30.1374 1.9603 10.4592 9.8134 282.9685 48.4735 15.5437 11.0734 32.7515 23.1975 311.1459 246.1230 74.8768 44.9647 32.9707 19.4645 3.6277 0.3814 0.8627 1.1348 0.3229
temp: 298.150 k
press: 1.00000 atm
elementType: 35 35 35 35 35 8 6 6 6 6 6 6 6 6 6 6 6 6 1 1 1 1 1
symmnumber: 1
zpe: 341741.6 jmol-1
zpe.correction: 0.130162 hartree
zpe.thermalcorrener: 0.148339 hartree
zpe.thermalcorrenthalpy: 0.149283 hartree
zpe.thermalcorrgfe: 0.076657 hartree
zpe.sumelectzpe: -601.512761 hartree
zpe.sumelectthermal: -601.494585 hartree
zpe.sumelectthermalent: -601.493641 hartree
zpe.sumelectthermalfe: -601.566267 hartree
dipole: -1.9345 -0.0059 -1.6460
dipole: 2.5401
quadrupole: -149.3780 -147.2868 -150.5432
quadrupole: 0.0135 3.4598 -0.0079
quadrupole: -0.3087 1.7826 -1.4739 0.0135 3.4598 -0.0079
hfenergy: -601.6429238 hartree
pointgroup: C01 [X(C12H5Br5O1)]
dipole: 0.7603437 -0.6484902 -0.002339 debye
dipolederiv: -0.1276386 0.0668035 -0.2337599 0.0541849 0.0051745 0.0907617 -0.2412397 0.1066024 -0.4818544 -0.1277278 0.0651278 0.2343866 0.0524325 0.0066068 -0.0872153 0.241669 -0.103016 -0.4830247 -0.0162889 0.0479651 0.0001898 -0.0056674 -0.6249342 -0.0024583 -0.0000348 -0.0025011 0.0139605 -0.7119147 0.2107335 0.0006402 0.26099 -0.0771023 -0.0000483 0.0008291 -0.0000481 -0.0542842 -0.5852719 -0.3127544 -0.0011992 -0.320533 -0.2556305 -0.0008891 -0.0011548 -0.000875 -0.019993 -2.2604529 -0.1993102 -0.0009889 -0.2000553 -0.2881782 -0.0002343 -0.0009973 -0.0001695 -0.2271256 1.3044148 0.0215077 0.0003723 -0.5324863 0.0844399 0.0015818 -0.0016997 0.0016149 -0.3769689 1.6234461 0.3012098 0.0012808 0.9561056 -0.088392 -0.0008899 0.0037723 -0.0009834 0.1621832 0.1658655 -0.2008739 0.3988392 -0.0976005 -0.0516586 -0.1447423 0.3313758 -0.1842488 0.8974199 0.1661124 -0.1980423 -0.4005796 -0.0952445 -0.0539765 0.1378448 -0.3322226 0.1772774 0.8994258 -0.2213292 -0.1196595 -0.0004996 -0.1160438 1.153572 0.0050047 -0.0005499 0.0050801 -0.1443705 -0.2419586 0.1029266 0.0003626 -0.280225 -0.0043245 0.0004513 -0.0010609 0.0004811 -0.1261807 -0.5178287 0.1524018 -0.1880617 0.1633277 -0.0789541 0.0646812 -0.1450455 0.0727374 -0.2675018 -0.5182188 0.1511558 0.1890976 0.1623649 -0.0779781 -0.0632996 0.1461207 -0.0713034 -0.2683093 1.2693315 -0.4476708 -0.0014414 -0.5046905 0.031636 -0.0006881 -0.0017331 -0.0006755 0.2052053 -0.2085471 -0.164565 -0.0006375 -0.1420158 -0.369117 -0.0013216 -0.000464 -0.0013441 -0.0209117 -0.1874678 -0.1897357 -0.0007105 -0.1437683 -0.0569114 0.00011 -0.0005774 0.0001102 -0.0767089 0.9476801 0.5857059 0.0021942 0.6034386 0.3537804 0.0018559 0.002158 0.0018517 -0.144217 -0.0198182 0.0405357 0.000174 0.1015631 0.0478102 -0.0003256 0.000414 -0.0003649 0.1326744 0.0791251 0.0192395 0.0324021 0.0278625 0.1487535 -0.011011 0.036129 -0.0116625 0.0375857 0.0792599 0.0194292 -0.0322542 0.0281232 0.1485795 0.0118426 -0.0358131 0.0124333 0.0377114 0.0213722 0.0449406 0.0001752 0.0409859 0.0824661 -0.00027 0.0001852 -0.0002684 0.1508709 0.0878557 0.0029295 0.0000178 -0.0130485 -0.0356618 -0.0007405 -0.0000604 -0.0007277 0.1544134 unknown
polarizability: 304.9508526|-11.4137209|177.742462|-0.0317879|0.021992|177.7418891 unknown
InChI: InChI=1S/C12H5Br5O/c13-6-1-2-11(8(15)3-6)18-12-9(16)4-7(14)5-10(12)17/h1-5H
charge 0 multiplicity 1
23 atoms
Br 0.97079 0.646825 -2.903092
Br 0.969637 0.626083 2.907997
Br -2.548979 2.935914 0.011139
Br 5.678897 -1.094948 -0.002819
Br -5.310053 -2.169786 -0.00852
O  -0.081966 1.126025 0.004028
C  1.188559 0.527267 0.002111
C  -1.238895 0.319749 0.000865
C  1.872344 0.290521 -1.218262
C  1.871885 0.281881 1.22104
C  -2.4869 0.98972 0.003523
C  -1.203879 -1.092428 -0.00471
C  3.198843 -0.188866 -1.23324
C  3.198378 -0.19759 1.233105
C  3.841583 -0.428741 -0.000787
C  -3.690923 0.257795 0.000742
C  -2.403069 -1.836136 -0.007537
C  -3.635217 -1.152503 -0.004771
H  -0.241409 -1.613958 -0.006888
H  3.712758 -0.363612 -2.181122
H  3.711943 -0.3791 2.17991
H  -4.648831 0.783745 0.002889
H  -2.369095 -2.928957 -0.011799
