program: Gaussian 09
title: 000154062
version: EM64L-G09RevD.01
frameworkgroup: C1[X(C15H20N2O4)]
method: RPBEPBE
basis: SDD
operation: Freq
keyword: #p
keyword: freq=noraman
keyword: PBEPBE/SDD
title: #p freq=noraman PBEPBE/SDD
converged: YES YES NO NO
title: Mulliken charges:
elementType: O O O O N N C C C C C C C C C C C C C C C H H H H H H H H H H H H H H H H H H H H
charge: -0.228016 -0.466387 -0.470381 -0.437842 -0.348107 -0.407866 -0.152404 0.022680 -0.128413 -0.165029 -0.353804 -0.369679 -0.557636 0.398442 0.110982 0.223684 -0.449565 -0.410980 -0.352643 -0.260368 -0.218158 0.237086 0.187158 0.201117 0.266128 0.163413 0.244809 0.300293 0.212174 0.238664 0.196260 0.232549 0.366749 0.365041 0.332949 0.267551 0.302474 0.243092 0.225080 0.219277 0.219626
chargesum: 0.00000
title: Mulliken charges with hydrogens summed into heavy atoms:
elementType: O O O O N N C C C C C C C C C C C C C C C
charge: -0.228016 -0.099637 -0.105340 -0.104893 -0.047814 -0.105393 0.084682 0.209838 0.072704 0.101099 0.054418 0.081159 -0.128828 0.398442 0.110982 0.223684 -0.182014 -0.167888 -0.127564 -0.041091 0.001468
polarizability: 2.34217492e+02 2.27075830e+00 2.15576284e+02 -1.65303677e+01 1.42643457e+00 1.16988200e+02
1716.lowfreq: -2.4115 -0.0006 -0.0003 0.0001 4.4296 5.3537 12.7978 24.5465 34.9673
frequency: 12.1575 23.5456 34.5395 57.6205 72.7746 99.9600 112.2485 125.7589 157.5218 206.8842 213.9872 219.6186 234.4719 245.4550 258.1085 283.5943 302.7342 329.5870 376.0417 384.2761 412.9055 424.3996 427.6283 447.1912 451.4803 460.4234 466.1976 497.7608 503.5887 508.9533 537.4419 574.9346 576.5676 586.4452 614.1587 639.0142 736.4961 748.7997 749.4555 770.9132 789.5575 805.6154 843.1455 852.0717 867.5424 874.2070 932.3831 936.2304 970.2675 971.0197 992.8933 1000.7404 1011.0506 1017.7578 1027.0503 1048.6506 1065.3114 1068.8020 1078.1908 1093.4035 1104.7658 1129.2081 1132.8993 1159.9208 1170.2780 1180.0091 1194.6130 1216.8262 1232.6612 1238.8164 1247.2621 1257.0171 1276.0619 1283.2866 1287.1886 1291.3503 1302.4581 1308.0405 1325.1371 1343.4328 1347.5467 1350.6034 1367.2248 1370.3034 1384.0513 1390.7874 1409.5810 1420.9489 1456.1763 1459.6540 1468.5289 1481.6293 1486.6971 1493.1781 1565.2812 1587.2106 1631.6348 2854.8272 2890.6725 2909.0551 2921.8173 2976.5142 2982.5389 3029.5850 3057.3345 3073.7807 3091.4487 3121.5720 3129.1866 3143.0241 3161.0097 3217.9552 3532.4927 3537.1599 3541.0969 3544.8109 3614.2152
redmass: 5.2086 5.4226 5.4153 4.1616 5.5343 2.9635 3.4716 4.5961 5.1492 3.9339 3.7811 3.8432 3.3095 3.5038 3.5822 2.0084 3.6386 1.2559 4.6745 4.3980 2.8132 2.8542 3.3502 1.1494 2.3278 1.4771 2.7728 1.3998 3.3447 3.9461 5.7186 4.5617 3.1614 2.9010 4.1340 3.3002 3.6568 1.3669 3.5514 3.6890 1.3649 1.5276 4.4299 1.4714 5.1211 2.4793 1.3785 3.8214 7.2800 1.3568 3.3212 2.9312 2.0945 2.4022 4.0377 3.2604 2.2868 3.0904 3.1539 1.6819 2.1846 2.5624 1.5485 1.2105 1.1382 1.2496 1.4884 1.1904 1.8328 1.5876 1.5217 1.5561 1.3727 1.5869 1.2622 1.2667 1.3962 1.3044 1.3540 1.3665 1.3120 1.7229 1.4163 1.2321 1.5066 5.3205 1.6062 2.3748 1.0905 3.9863 1.1028 3.0360 1.0962 1.4549 6.2910 6.2089 6.8455 1.0821 1.0698 1.0706 1.0815 1.0606 1.0845 1.0962 1.0950 1.0858 1.0928 1.0847 1.0891 1.0953 1.1001 1.0983 1.0658 1.0664 1.0751 1.0655 1.0809
irintensity: 1.0139 0.3787 0.7229 0.1180 0.9386 2.2079 4.8779 0.0719 4.7759 5.3499 25.7031 2.8623 14.8729 1.5010 3.1216 42.9577 9.4869 68.8493 22.9168 16.1190 3.0905 18.5366 7.9317 124.4511 67.6871 203.5539 2.7354 80.8357 44.3380 8.6197 0.9755 2.7142 8.7206 34.2616 2.1313 2.3978 0.9766 109.9208 10.4834 9.1773 9.8085 18.2521 134.3708 0.6143 0.9023 35.3591 3.3018 68.5533 120.9810 5.8280 18.1007 56.5110 5.4290 20.7127 14.7672 98.2509 13.4142 31.4621 4.4554 48.9642 2.1345 1.8966 12.2173 55.3281 11.0996 7.3487 23.8013 3.2584 80.6301 51.9732 7.3347 35.1287 16.5933 0.6254 25.0090 11.1170 5.9812 7.7567 28.9497 14.0252 9.7909 21.8309 6.7900 22.3156 1.7965 32.4665 6.2613 3.1731 9.4300 20.2693 6.8803 2.4158 23.0199 77.8940 4.3037 0.1201 2.3344 50.6536 62.5376 73.8388 67.0415 42.6644 50.0715 10.0626 28.0560 13.0526 22.8499 1.4053 5.1347 38.8771 28.4955 1.5467 10.0547 21.2747 10.8544 18.6180 59.6947
temp: 298.150 k
press: 1.00000 atm
elementType: 8 8 8 8 7 7 6 6 6 6 6 6 6 6 6 6 6 6 6 6 6 1 1 1 1 1 1 1 1 1 1 1 1 1 1 1 1 1 1 1 1
symmnumber: 1
zpe: 878142.1 jmol-1
zpe.correction: 0.334467 hartree
zpe.thermalcorrener: 0.354604 hartree
zpe.thermalcorrenthalpy: 0.355549 hartree
zpe.thermalcorrgfe: 0.283899 hartree
zpe.sumelectzpe: -992.379243 hartree
zpe.sumelectthermal: -992.359106 hartree
zpe.sumelectthermalent: -992.358161 hartree
zpe.sumelectthermalfe: -992.429811 hartree
dipole: 0.6349 -0.9309 -2.7668
dipole: 2.9875
quadrupole: -106.1851 -115.7791 -125.6955
quadrupole: -13.1548 1.3628 -3.9021
quadrupole: 9.7015 0.1075 -9.8090 -13.1548 1.3628 -3.9021
hfenergy: -992.7137101 hartree
pointgroup: C01 [X(C15H20N2O4)]
dipole: 0.2312078 -0.3752157 -1.0896004 debye
polarizability: 234.1060122|1.6933219|215.4620995|-17.2844576|1.7641078|117.2138652 unknown
InChI: InChI=1S/C15H20N2O4/c18-12-8-21-15(14(20)13(12)19)16-6-5-9-7-17-11-4-2-1-3-10(9)11/h1-4,7,12-20H,5-6,8H2
charge 0 multiplicity 1
41 atoms
O  -2.240304 1.028486 0.539191
O  -3.74798 -2.281365 -0.410285
O  -6.053587 -0.660115 -0.018118
O  -5.726432 2.248894 -0.347891
N  -1.238218 -1.140798 0.362221
N  4.679142 -1.752036 -0.529421
C  -3.672913 -0.942763 0.184013
C  -2.29218 -0.337756 -0.136434
C  -4.775286 -0.03087 -0.368051
C  -4.660046 1.389134 0.211186
C  -3.238124 1.938782 -0.036922
C  0.115354 -1.005139 -0.192387
C  1.181671 -1.50354 0.818887
C  2.59279 -1.325619 0.316285
C  3.30701 -0.065394 0.171182
C  4.612106 -0.363954 -0.361491
C  3.463153 -2.324313 -0.119283
C  2.973043 1.287319 0.451151
C  5.572355 0.639098 -0.621236
C  3.926209 2.292017 0.195172
C  5.211202 1.971969 -0.337062
H  -3.784466 -1.00136 1.28794
H  -2.212307 -0.125357 -1.233406
H  -4.674652 0.022623 -1.478306
H  -4.875362 1.367161 1.292521
H  -3.071099 2.06966 -1.134713
H  -3.095913 2.908384 0.465896
H  -1.511077 -2.070489 0.687608
H  0.241095 -1.557634 -1.15236
H  0.290098 0.064274 -0.404312
H  0.993453 -2.573273 1.040593
H  1.026988 -0.950337 1.765181
H  -4.693712 -2.575977 -0.33886
H  -6.771808 0.006269 -0.175986
H  -5.498839 2.4702 -1.288664
H  3.306994 -3.401064 -0.164304
H  5.483295 -2.266094 -0.880998
H  1.991908 1.545912 0.865855
H  6.562103 0.398678 -1.026035
H  3.683119 3.339022 0.408269
H  5.93072 2.776766 -0.525624
