program: Gaussian 09
title: 000154059
version: EM64L-G09RevD.01
frameworkgroup: C1[X(C23H26N2O2)]
method: RPBEPBE
basis: SDD
operation: Freq
keyword: #p
keyword: freq=noraman
keyword: PBEPBE/SDD
title: #p freq=noraman PBEPBE/SDD
converged: YES YES NO NO
title: Mulliken charges:
elementType: O O N N C C C C C C C C C C C C C C C C C C C C C C C H H H H H H H H H H H H H H H H H H H H H H H H H H
charge: -0.340820 -0.287812 0.001725 -0.215368 -0.180884 0.016263 -0.455145 -0.462393 -0.491288 -0.451094 -0.442854 0.279758 -0.417703 -0.356417 0.397163 -0.634725 0.365530 0.429308 -0.456102 -0.453516 -0.400496 -0.391890 -0.246395 -0.230567 -0.224623 -0.235781 -0.248832 0.229463 0.251340 0.232633 0.206699 0.211474 0.214947 0.251972 0.231507 0.236054 0.223355 0.227305 0.226205 0.292934 0.249257 0.244136 0.233509 0.247242 0.247647 0.240089 0.250781 0.246304 0.229585 0.228022 0.225291 0.228213 0.228994
chargesum: 0.00000
title: Mulliken charges with hydrogens summed into heavy atoms:
elementType: O O N N C C C C C C C C C C C C C C C C C C C C C C C
charge: -0.340820 -0.287812 0.001725 -0.215368 0.048578 0.267603 -0.015813 -0.035972 -0.007810 0.008315 0.010656 0.279758 -0.124769 0.136976 0.397163 -0.153973 0.365530 0.429308 -0.208455 -0.213426 -0.149715 -0.145586 -0.016811 -0.002545 0.000668 -0.007568 -0.019839
polarizability: 2.87983350e+02 -1.37226852e+01 2.40828549e+02 -1.84029757e+01 4.34475532e+00 2.29135669e+02
1716.lowfreq: -6.3140 -0.0004 0.0006 0.0009 2.4199 7.1940 13.6624 19.5655 33.9261
frequency: 12.6698 18.4846 33.8859 40.1694 48.3552 59.8610 76.0779 84.6767 95.4393 134.3671 157.0681 172.2616 204.8736 217.2738 248.0845 267.5355 279.0332 296.4438 320.2438 345.7867 354.5125 381.3249 404.5952 408.3430 410.8120 427.4364 463.3452 488.5072 514.6319 523.9831 544.9014 573.9898 586.7706 597.4874 610.8177 616.4282 639.0686 690.9265 702.1318 707.3818 730.7073 741.8363 748.9695 760.6270 768.9097 786.4176 798.3763 807.9194 818.7647 835.9341 844.4376 858.0539 864.2250 872.7640 885.0729 903.7687 921.7619 935.5206 936.9702 951.0956 954.5941 973.5480 982.3551 988.9745 990.0254 991.9989 997.7061 1005.2135 1020.6841 1027.1542 1028.3588 1037.5690 1054.7166 1061.5611 1075.1535 1085.5833 1100.3549 1110.7190 1129.9422 1150.2049 1168.0174 1171.4370 1173.1060 1176.1170 1191.3719 1197.0920 1197.7769 1213.5206 1215.4609 1217.1134 1230.0996 1232.0949 1256.9833 1266.1414 1279.0498 1296.5664 1297.1317 1301.5011 1303.8824 1307.6337 1311.9955 1314.1901 1321.6051 1326.2062 1334.7079 1345.5468 1355.5253 1363.8535 1377.1769 1382.1512 1391.4173 1434.3969 1439.8724 1446.5078 1458.8082 1459.1226 1466.3576 1468.2258 1478.9389 1479.4940 1483.5620 1489.4592 1591.1441 1596.7056 1609.6840 1618.5199 1621.7561 2981.4575 2985.4263 2989.9278 2992.1751 3000.8534 3003.0803 3008.7434 3025.4118 3035.6333 3037.4916 3043.7415 3044.0104 3049.5854 3063.2625 3066.4473 3074.7207 3079.3550 3117.7668 3122.0568 3123.0108 3129.7585 3139.9540 3143.1157 3150.7158 3161.0606 3164.1128
redmass: 4.9353 3.8922 3.5969 3.6078 4.7174 4.3815 3.9594 7.3414 3.6951 3.3348 2.7290 4.0386 3.5017 4.5399 3.2600 2.9320 3.5048 2.9744 3.3892 4.5448 5.0891 3.3295 2.8495 2.5335 2.3177 2.9378 3.4540 4.1226 4.1274 4.9028 4.0520 3.6168 4.7888 4.8164 5.4296 6.0703 5.5546 8.7089 3.8095 2.6444 1.8272 4.3176 3.7005 1.6895 2.3275 1.4901 2.0144 1.7948 2.4052 2.2891 2.8664 1.2748 3.4457 2.9772 1.4704 3.3403 2.1713 1.9440 1.8422 1.4320 3.6876 2.7029 1.3978 1.3752 5.1588 2.4566 1.3142 2.8203 2.8488 2.3552 2.3938 2.2787 2.6023 2.3739 2.4212 1.6132 1.6618 1.9343 1.3624 2.3750 1.2236 1.0722 1.1522 2.1670 1.1724 2.2071 1.3939 1.4811 1.4191 1.5160 1.2762 1.5419 1.9167 1.4625 1.5980 1.3216 1.3113 1.4274 1.3070 1.3877 1.3903 1.3355 1.4123 1.3259 1.5337 1.3810 1.5243 1.5108 3.7379 3.5002 4.9210 2.2211 1.0827 2.3214 1.1309 1.0795 1.0839 1.0827 2.1435 1.0900 1.6097 1.4959 6.2489 6.8357 6.1508 6.7918 11.2890 1.0596 1.0655 1.0602 1.0591 1.0607 1.0621 1.0620 1.0864 1.0832 1.1028 1.1002 1.0920 1.1013 1.0988 1.1056 1.1050 1.1045 1.0864 1.0845 1.0893 1.0875 1.0934 1.0919 1.0953 1.1004 1.1012
irintensity: 0.0584 0.1311 0.0821 0.0239 0.5530 0.4652 0.1800 1.7276 0.5464 2.4102 1.5928 2.3507 1.9789 1.6579 3.8843 3.8791 0.9466 1.9436 8.8761 1.4631 2.7102 1.9144 0.0496 0.7029 3.0435 3.6511 6.5881 6.2102 0.7282 1.5106 3.8572 7.1583 6.5738 2.3160 9.3528 1.1610 13.9747 16.9195 4.2812 34.7138 39.3480 9.8576 17.1394 51.7707 16.8437 9.8336 18.3910 6.8010 18.4178 11.4026 3.0461 0.5603 22.3857 1.2646 0.3694 5.6975 12.8367 3.4424 7.3579 0.9142 6.8756 91.1257 0.1538 0.0287 1.1479 33.9772 0.3119 76.5258 4.1450 30.7981 34.0747 60.8119 27.2102 11.5172 29.5611 3.7276 0.2960 35.3075 4.1508 8.2791 6.3119 0.4408 0.6665 10.1009 2.1155 4.0805 4.6275 20.1956 19.4746 33.9280 0.6392 31.9371 22.8193 41.8130 186.1424 4.2354 2.1028 38.1249 2.5912 2.1871 3.5447 3.0387 50.5957 0.4881 1.6659 16.6093 42.7175 9.4147 56.4865 83.7879 2.7141 11.6455 17.0781 7.0159 15.9842 0.6538 9.1658 16.6361 17.5707 7.1432 10.8280 17.9402 2.5539 1.9426 26.2802 15.2125 416.4679 34.4369 15.0352 22.1044 28.2086 95.4145 76.6684 24.1357 7.9002 4.3862 9.6990 5.0129 52.4853 3.9763 30.1261 22.8366 82.8755 52.2092 7.9716 1.1776 2.9299 2.4700 26.5791 15.2969 35.8745 35.6868 20.8955
temp: 298.150 k
press: 1.00000 atm
elementType: 8 8 7 7 6 6 6 6 6 6 6 6 6 6 6 6 6 6 6 6 6 6 6 6 6 6 6 1 1 1 1 1 1 1 1 1 1 1 1 1 1 1 1 1 1 1 1 1 1 1 1 1 1
symmnumber: 1
zpe: 1164507.4 jmol-1
zpe.correction: 0.443537 hartree
zpe.thermalcorrener: 0.466219 hartree
zpe.thermalcorrenthalpy: 0.467163 hartree
zpe.thermalcorrgfe: 0.388787 hartree
zpe.sumelectzpe: -1150.035062 hartree
zpe.sumelectthermal: -1150.012381 hartree
zpe.sumelectthermalent: -1150.011437 hartree
zpe.sumelectthermalfe: -1150.089812 hartree
dipole: 1.9867 0.2931 -2.4659
dipole: 3.1802
quadrupole: -148.1867 -157.0136 -156.4528
quadrupole: 1.0351 8.5394 4.6630
quadrupole: 5.6977 -3.1292 -2.5684 1.0351 8.5394 4.6630
hfenergy: -1150.4785997 hartree
pointgroup: C01 [X(C23H26N2O2)]
dipole: -0.751338 0.7671659 0.6421598 debye
polarizability: 290.7647777|-6.4648017|233.2306222|-19.0835651|-4.5510095|233.9521671 unknown
InChI: InChI=1S/C23H26N2O2/c26-23(27-21-16-24-13-10-18(21)11-14-24)25-15-12-17-6-4-5-9-20(17)22(25)19-7-2-1-3-8-19/h1-9,18,21-22H,10-16H2
charge 0 multiplicity 1
53 atoms
O  1.348284 -0.826308 0.439943
O  0.873555 -2.803604 -0.751656
N  4.819051 -0.36848 -0.257104
N  -0.725517 -1.1079 -0.540563
C  3.308325 -0.522819 1.85848
C  2.712043 -1.371681 0.716697
C  3.447117 0.958282 1.410784
C  4.720809 -1.096077 2.17012
C  3.65015 -1.250833 -0.534225
C  4.333126 0.997907 0.112931
C  5.608584 -0.937817 0.877868
C  0.514462 -1.671109 -0.321523
C  -1.142683 0.19135 0.056795
C  -1.701613 -1.923317 -1.314737
C  -2.530108 0.028272 0.670992
C  -3.05817 -1.19116 -1.443714
C  -3.507941 -0.659356 -0.096231
C  -1.063438 1.355744 -0.963103
C  -2.856152 0.529447 1.949167
C  -4.808279 -0.830179 0.426812
C  -1.828407 2.534232 -0.771134
C  -0.173453 1.294584 -2.064216
C  -4.16266 0.364079 2.466172
C  -5.139886 -0.314525 1.702362
C  -1.708391 3.624306 -1.662482
C  -0.053496 2.382806 -2.957206
C  -0.820095 3.554217 -2.759716
H  2.658002 -0.595883 2.748099
H  2.589057 -2.42699 1.021284
H  2.448706 1.389065 1.221207
H  3.912129 1.540033 2.229157
H  5.155755 -0.543897 3.024132
H  4.644836 -2.158427 2.472525
H  4.016081 -2.245239 -0.841832
H  3.082292 -0.825007 -1.381097
H  3.759105 1.39268 -0.744701
H  5.217476 1.646368 0.249231
H  6.46457 -0.264406 1.063521
H  6.016674 -1.9125 0.554234
H  -0.414433 0.410546 0.857202
H  -1.837685 -2.892369 -0.79856
H  -1.281539 -2.143779 -2.313358
H  -3.798851 -1.889911 -1.870778
H  -2.949619 -0.351581 -2.158472
H  -2.091044 1.044574 2.542928
H  -5.562853 -1.367542 -0.160222
H  -2.527797 2.596947 0.069683
H  0.422003 0.389772 -2.225348
H  -4.413753 0.754368 3.458544
H  -6.151532 -0.449086 2.101316
H  -2.310765 4.525797 -1.501697
H  0.637658 2.316094 -3.805243
H  -0.728689 4.398414 -3.452268
