program: Gaussian 09
title: 000154029
version: EM64L-G09RevD.01
frameworkgroup: C1[X(C15H12N2)]
method: RPBEPBE
basis: SDD
operation: Freq
keyword: #pfreq=noraman
keyword: PBEPBE/SDD
title: #p freq=noraman PBEPBE/SDD
converged: NO YES NO NO
title: Mulliken charges:
elementType: N N C C C C C C C C C C C C C C C H H H H H H H H H H H H
charge: -0.684517 -0.031078 0.534196 0.525306 -0.325409 -0.342029 -0.382352 -0.399239 0.490144 -0.421223 -0.427844 -0.385616 -0.402181 -0.382750 -0.385364 0.383677 -0.266115 0.215747 0.215652 0.222358 0.225629 0.218700 0.219910 0.226608 0.231352 0.251757 0.252810 0.310869 0.311002
chargesum: 0.00000
title: Mulliken charges with hydrogens summed into heavy atoms:
elementType: N N C C C C C C C C C C C C C C C
charge: -0.062646 -0.031078 0.534196 0.525306 -0.109662 -0.126377 -0.159994 -0.173610 0.490144 -0.202522 -0.207935 -0.159008 -0.170829 -0.130993 -0.132554 0.383677 -0.266115
polarizability: 5.28730598e+02 -2.60813491e+00 1.57547603e+02 7.18817200e-03 -6.17636770e-05 6.74540266e+01
1716.lowfreq: -2.9381 -0.0002 0.0002 0.0009 5.1655 6.0481 28.6951 32.7801 55.4993
frequency: 28.6781 32.7784 55.4959 72.8770 135.9041 143.6210 181.8066 188.9660 254.4122 273.6484 357.0488 368.6386 392.4997 398.2350 403.3520 410.4737 435.1267 465.9500 467.5885 520.6723 543.6068 554.1959 562.3851 636.7740 645.4979 726.9875 727.6105 748.1025 796.1604 811.8395 821.9512 831.0061 839.8012 844.1239 867.1722 893.3167 943.4423 956.4690 967.6397 978.4046 984.8157 996.8033 1005.8135 1018.7848 1120.0470 1133.2236 1185.0588 1191.3507 1210.4138 1213.2034 1251.0011 1296.8636 1302.7786 1320.6461 1330.6700 1336.1965 1367.9581 1391.8265 1427.5651 1451.5184 1496.9253 1524.7098 1546.4143 1567.0777 1602.4447 1631.8814 1639.3734 1649.6261 2168.3739 3087.0969 3100.5214 3114.9425 3119.2617 3128.6518 3138.6878 3139.3846 3148.4166 3159.9599 3164.3215 3561.5708 3701.5038
redmass: 3.5483 6.8087 6.0326 5.5192 7.4656 4.9285 6.9446 2.8642 5.1594 3.8220 3.1952 2.9800 1.0476 1.2708 2.8723 2.8830 8.5486 4.3652 4.1294 2.6282 7.1242 6.4276 2.7889 6.9982 7.1641 5.9859 3.1275 3.4932 4.8316 1.2954 1.6211 5.7599 1.2925 1.6622 4.3703 2.0244 1.3644 1.3691 1.3600 1.3804 1.2159 2.7579 2.9327 1.4442 1.4675 1.2894 1.6454 1.1303 2.0222 2.1205 1.3556 2.0975 1.4686 1.5473 3.6405 1.3138 3.2130 3.5111 3.9619 4.0089 2.5426 3.1369 6.2680 6.1696 5.4271 4.3768 1.6705 2.6716 12.6278 1.0906 1.0866 1.0868 1.0874 1.0886 1.0959 1.0876 1.0962 1.0961 1.0975 1.0450 1.1040
irintensity: 0.0095 0.0109 0.2523 4.1829 4.2547 0.9808 0.6717 2.0158 0.1956 0.4550 21.0125 2.2937 49.0338 249.3065 1.4661 0.0986 21.6657 0.8508 0.0594 8.8840 3.9992 4.5744 36.4554 0.5562 0.1245 1.0528 0.0015 2.1049 1.4052 0.3680 22.8854 1.0463 4.1192 105.0135 0.1424 9.3121 14.4842 0.0051 18.2495 0.0848 34.8917 0.0811 0.1054 0.2503 11.0186 13.1676 154.9536 65.5084 5.4904 2.2084 5.9256 4.6468 5.1080 0.0158 154.0897 39.6449 23.1314 15.6943 12.7293 15.2450 6.0275 154.1852 11.8468 17.0191 877.4169 97.6751 165.2855 199.9200 183.5524 2.3880 39.4032 15.1630 19.4787 11.8766 33.9938 12.6572 15.6688 20.0418 2.3931 207.1306 23.3455
temp: 298.150 k
press: 1.00000 atm
elementType: 7 7 6 6 6 6 6 6 6 6 6 6 6 6 6 6 6 1 1 1 1 1 1 1 1 1 1 1 1
symmnumber: 1
zpe: 593419.2 jmol-1
zpe.correction: 0.226021 hartree
zpe.thermalcorrener: 0.240796 hartree
zpe.thermalcorrenthalpy: 0.241740 hartree
zpe.thermalcorrgfe: 0.182817 hartree
zpe.sumelectzpe: -687.129901 hartree
zpe.sumelectthermal: -687.115127 hartree
zpe.sumelectthermalent: -687.114183 hartree
zpe.sumelectthermalfe: -687.173106 hartree
dipole: 10.4086 0.6703 0.0023
dipole: 10.4301
quadrupole: -110.2993 -82.9527 -107.6304
quadrupole: -2.4665 -0.0569 -0.0004
quadrupole: -10.0052 17.3414 -7.3363 -2.4665 -0.0569 -0.0004
hfenergy: -687.3559227 hartree
pointgroup: C01 [X(C15H12N2)]
dipole: 4.0940689 -0.278518 -0.0015068 debye
polarizability: 528.7445107|1.2641707|157.5261587|0.2204874|0.8184664|67.4615585 unknown
InChI: InChI=1S/C15H12N2/c16-11-14-5-3-12(4-6-14)1-2-13-7-9-15(17)10-8-13/h1-10H,17H2
charge 0 multiplicity 1
29 atoms
N  6.610466 -0.223772 0.003404
N  -6.982915 0.352397 0.003601
C  2.361264 0.225015 0.002733
C  -1.516393 -0.289796 -0.00574
C  0.914547 0.437463 0.003205
C  -0.069905 -0.523078 -0.008353
C  2.976077 -1.06492 -0.012277
C  3.232109 1.355785 0.017898
C  5.226687 -0.072343 0.002906
C  4.368767 -1.215753 -0.012454
C  4.628917 1.222186 0.017902
C  -2.112036 1.010707 0.001292
C  -2.397098 -1.415134 -0.011026
C  -3.504459 1.175417 0.003816
C  -3.792569 -1.262134 -0.00865
C  -4.367595 0.039996 -0.000962
C  -5.794167 0.209748 0.002217
H  0.609371 1.494197 0.0160
H  0.226203 -1.581405 -0.019075
H  2.353388 -1.966178 -0.024797
H  2.79424 2.361943 0.029772
H  4.810402 -2.219878 -0.024778
H  5.266235 2.1146 0.029173
H  -1.478119 1.903251 0.003878
H  -1.968213 -2.424294 -0.016961
H  -3.941488 2.179262 0.009053
H  -4.446722 -2.139841 -0.01301
H  7.224279 0.585831 0.01365
H  7.034428 -1.147072 -0.006118
