program: Gaussian 09
title: 000154021
version: EM64L-G09RevD.01
frameworkgroup: C1[X(C5H9N3O4)]
method: RPBEPBE
basis: SDD
operation: Freq
keyword: #pfreq=noraman
keyword: PBEPBE/SDD
title: #p freq=noraman PBEPBE/SDD
converged: NO YES NO NO
title: Mulliken charges:
elementType: O O O O N N N C C C C C H H H H H H H H H
charge: -0.415972 -0.224630 -0.256026 -0.237894 -0.147126 0.038140 -0.622544 -0.350803 -0.385793 -0.474051 0.180945 0.306604 0.241724 0.246084 0.245401 0.252745 0.258849 0.258200 0.359202 0.347599 0.379346
chargesum: 0.00000
title: Mulliken charges with hydrogens summed into heavy atoms:
elementType: O O O O N N N C C C C C
charge: -0.036626 -0.224630 -0.256026 -0.237894 -0.147126 0.038140 0.084258 0.137005 0.112353 0.042998 0.180945 0.306604
polarizability: 1.05825671e+02 -4.91023838e-01 9.32805682e+01 1.03713543e+01 2.78770562e+00 6.96693615e+01
1716.lowfreq: -3.2221 -0.0010 -0.0008 -0.0008 3.3313 9.3197 20.9491 28.9269 64.1993
frequency: 20.8349 28.8911 64.1988 83.2507 87.4021 96.5402 162.7996 217.9421 274.4620 292.4451 326.2172 402.6570 438.9419 477.6921 503.8033 531.4811 558.3270 587.2459 631.6900 638.5168 640.7315 715.0918 736.7629 803.0338 830.4772 878.6725 942.7063 1019.7550 1053.3194 1064.3346 1089.2594 1112.0954 1165.4890 1212.3352 1240.3167 1286.8121 1292.4327 1320.6234 1352.9053 1361.8593 1377.0108 1382.0148 1435.6049 1443.6966 1476.8469 1565.5913 1671.9493 1681.7593 2991.5900 3016.3122 3026.4491 3040.1852 3079.6774 3103.5281 3512.5603 3515.1748 3683.8545
redmass: 12.5190 7.4420 5.4884 3.0053 1.9012 7.9794 6.8089 8.3149 7.4334 4.9015 2.6828 6.2556 5.3803 5.4991 1.8005 2.0856 1.5741 4.6500 3.9310 1.3679 1.1139 10.0095 1.2304 3.5874 2.1376 4.6767 2.3368 3.3882 2.7777 2.5667 2.6970 1.7746 3.8602 1.6212 1.4111 1.1717 1.5020 1.2990 1.7615 4.3494 2.6864 1.7135 1.1222 1.0957 1.0883 1.2280 8.3538 7.7417 1.0607 1.0603 1.0594 1.0987 1.1022 1.1045 1.0467 1.0640 1.1034
irintensity: 1.1742 0.1604 4.9619 0.4128 0.7855 5.2512 2.9786 6.8325 1.5513 25.3851 2.8036 10.2123 19.6935 27.1323 30.1582 69.2502 60.0510 14.0253 17.5158 144.3966 161.5124 34.6996 40.1016 13.1782 42.0009 15.4708 113.3787 187.3510 28.1692 31.3906 65.8680 5.9262 76.5514 0.6970 2.3467 5.3192 41.4887 39.6288 170.6051 159.1704 6.8582 76.2555 11.4685 44.3471 15.7721 165.7659 215.2071 301.9099 9.1784 0.7340 22.2270 2.8742 6.7924 6.1224 52.0367 22.2810 79.1735
temp: 298.150 k
press: 1.00000 atm
elementType: 8 8 8 8 7 7 7 6 6 6 6 6 1 1 1 1 1 1 1 1 1
symmnumber: 1
zpe: 410009.0 jmol-1
zpe.correction: 0.156164 hartree
zpe.thermalcorrener: 0.169034 hartree
zpe.thermalcorrenthalpy: 0.169979 hartree
zpe.thermalcorrgfe: 0.114149 hartree
zpe.sumelectzpe: -660.116019 hartree
zpe.sumelectthermal: -660.103149 hartree
zpe.sumelectthermalent: -660.102205 hartree
zpe.sumelectthermalfe: -660.158035 hartree
dipole: 0.8202 -0.4074 -0.8102
dipole: 1.2228
quadrupole: -49.6087 -82.1227 -72.7714
quadrupole: -3.4598 7.3739 -2.6135
quadrupole: 18.5589 -13.9551 -4.6038 -3.4598 7.3739 -2.6135
hfenergy: -660.2721836 hartree
pointgroup: C01 [X(C5H9N3O4)]
dipole: -0.3246146 0.1553253 -0.3192679 debye
dipolederiv: -1.191083 0.0231981 0.4773715 0.0205562 -0.4238623 0.0156322 0.3833123 0.0101957 -0.4813046 -0.6838085 -0.0364265 -0.0863921 0.0029085 -0.3091867 -0.0956419 0.1486888 -0.0871589 -0.9471407 -0.6439949 -0.0302749 0.1318479 -0.1110282 -0.9856085 0.2049627 0.162638 0.1355543 -0.4609118 -0.2246862 0.5273565 -0.0441999 -0.118864 -1.0637572 0.1467623 0.0196582 -0.1272554 -0.1784259 -0.4536568 -0.0842926 0.0908038 0.309989 -1.3341928 0.0338002 0.0367917 0.2497675 -0.1818706 -0.0986238 0.0108798 -0.014415 0.2402279 1.482366 -0.2867312 0.0256415 -0.2794996 -0.0099562 -1.1842524 0.0486657 0.2066496 0.0205822 -0.3569556 -0.0450622 0.2606133 -0.0768509 -0.7902363 0.081712 0.0121615 0.0245387 -0.0100131 0.1133985 -0.0148247 0.0696854 0.0388126 -0.0229152 0.3085876 -0.030677 -0.0018898 0.0021014 0.0604615 0.0357475 -0.0446167 -0.0092302 0.2311313 -0.1889784 -0.0396408 -0.1082163 -0.0520522 0.1510187 -0.0392303 -0.3426303 -0.0742595 -0.1332548 1.5874714 0.0433649 -0.1888331 0.0295849 0.2105918 0.1449307 -0.2106646 0.1531473 1.295186 1.4968777 -0.4128426 -0.5007537 -0.2831646 1.664805 -0.1552339 -0.5769412 -0.0157064 0.6171846 0.0513983 -0.0229618 0.004366 0.0123058 -0.0099907 0.0926787 0.0111017 0.0658553 -0.0014789 0.0514555 0.0285325 0.0080438 0.0105635 -0.0350066 -0.0804309 0.0261379 -0.0650313 0.0290907 0.0347484 -0.0077674 0.0139121 0.0273855 -0.0167143 -0.1171312 0.0032088 -0.0227013 0.0478222 0.0569322 -0.0118943 -0.007019 -0.0235956 0.0567115 0.1062876 -0.0144881 0.0651291 0.0375825 0.0644572 -0.0002559 -0.0162065 -0.0197811 0.0112975 0.1027966 0.0334522 0.0799503 0.0249615 0.0562531 0.0098334 -0.0007906 0.033748 -0.0232777 -0.0954485 0.0398991 -0.0646839 0.0606271 0.3388036 -0.0104394 0.0404738 -0.0476884 0.2383718 0.042916 0.0390925 0.0310162 0.35061 0.2868988 0.0044481 0.0628238 -0.0171462 0.1869194 0.0408854 0.068148 0.0329555 0.3536318 0.2534882 -0.0209672 -0.092115 -0.0266197 0.3826108 -0.0376654 -0.1387285 -0.0400063 0.1596673 unknown
polarizability: 105.5742329|-0.9332324|93.1366859|-10.7852269|-3.2792649|70.0646823 unknown
InChI: InChI=1S/C5H9N3O4/c6-5(11)8(7-12)3-1-2-4(9)10/h9H,1-3,6H2
charge 0 multiplicity 1
21 atoms
O  4.505953 0.081651 -0.522091
O  3.296669 0.305183 1.448281
O  -1.986149 2.089726 -0.453758
O  -1.598251 -2.46146 0.121575
N  -1.707262 -0.232754 -0.215226
N  -2.285232 -1.39836 0.299443
N  -3.626409 0.845296 0.668179
C  0.780207 -0.053926 0.068272
C  -0.403512 -0.220548 -0.911855
C  2.11314 -0.051618 -0.702634
C  3.310105 0.130144 0.21156
C  -2.44657 1.004084 -0.012895
H  0.777452 -0.873052 0.808958
H  0.669477 0.893161 0.625276
H  -0.323489 -1.17989 -1.455266
H  -0.432397 0.616023 -1.629245
H  2.138613 0.760622 -1.455657
H  2.257051 -0.99319 -1.267336
H  -3.915566 -0.081133 0.984576
H  -4.191948 1.671796 0.844822
H  5.276218 0.208746 0.096018
