program: Gaussian 09
title: 000154015
version: EM64L-G09RevD.01
frameworkgroup: C1[X(C5H9N3O2)]
method: RPBEPBE
basis: SDD
operation: Freq
keyword: #pfreq=noraman
keyword: PBEPBE/SDD
title: #p freq=noraman PBEPBE/SDD
converged: YES YES NO NO
title: Mulliken charges:
elementType: O O N N N C C C C C H H H H H H H H H
charge: -0.282310 -0.225191 -0.066427 -0.010495 -0.063905 -0.184584 -0.392741 -0.693889 0.258720 -0.502676 0.242584 0.233384 0.263833 0.255936 0.205552 0.240503 0.247571 0.232635 0.241501
chargesum: 0.00000
title: Mulliken charges with hydrogens summed into heavy atoms:
elementType: O O N N N C C C C C
charge: -0.282310 -0.225191 -0.066427 -0.010495 -0.063905 0.058000 0.104476 0.008101 0.258720 0.219030
polarizability: 9.89651249e+01 1.41976526e+01 8.60128658e+01 3.61126091e-01 4.15328411e-01 6.31137885e+01
1716.lowfreq: -8.8974 -5.7377 -0.0003 0.0004 0.0009 12.0875 20.6663 39.9997 81.7528
frequency: 20.4189 39.9022 81.7509 92.7809 138.3376 156.1376 183.7736 195.6598 228.3258 313.5944 317.5008 445.9605 484.7525 497.4093 547.8413 595.4478 718.2955 773.8356 841.9909 897.3255 925.4509 962.0828 1038.6565 1092.2963 1114.0794 1131.8080 1150.0651 1153.9224 1220.0409 1265.9435 1285.3276 1321.6738 1349.6838 1397.5985 1423.0374 1451.6998 1452.3036 1464.5403 1467.3509 1481.5038 1650.7327 2043.4119 2972.4012 2986.8199 3000.7215 3006.0046 3052.8153 3097.0182 3108.7487 3114.3650 3149.6126
redmass: 6.3201 5.9840 4.1809 1.2090 3.9094 2.0974 1.6464 2.1608 6.1433 4.3513 2.3594 3.8794 11.4033 4.9844 6.7406 4.9500 4.0835 4.7607 3.8787 2.9457 1.8994 2.7300 1.6452 2.3036 1.2677 1.8529 1.8026 1.8368 1.1694 5.4819 2.1211 1.7508 1.2747 1.2094 1.1738 1.0736 1.0512 1.0488 1.0470 1.0554 10.0257 13.2352 1.0626 1.0775 1.0380 1.0294 1.1033 1.0992 1.1046 1.1004 1.1050
irintensity: 0.6168 0.8278 3.4793 0.2649 0.5331 5.0577 3.3012 4.3446 2.5392 17.0031 4.9518 3.5850 2.4920 12.8737 5.0612 14.5950 3.1042 8.2304 9.3465 12.6049 6.1771 14.9180 13.8552 113.0589 0.0560 13.4232 107.4846 77.9391 12.6638 73.2134 3.6309 13.1184 37.9790 34.3107 13.1034 31.3497 8.4373 12.2749 11.0361 14.3177 180.0570 372.3238 26.6346 26.7098 25.9130 29.7019 18.8315 22.1414 23.5630 22.7160 14.8437
temp: 298.150 k
press: 1.00000 atm
elementType: 8 8 7 7 7 6 6 6 6 6 1 1 1 1 1 1 1 1 1
symmnumber: 1
zpe: 382223.4 jmol-1
zpe.correction: 0.145581 hartree
zpe.thermalcorrener: 0.157194 hartree
zpe.thermalcorrenthalpy: 0.158139 hartree
zpe.thermalcorrgfe: 0.106069 hartree
zpe.sumelectzpe: -509.784839 hartree
zpe.sumelectthermal: -509.773226 hartree
zpe.sumelectthermalent: -509.772282 hartree
zpe.sumelectthermalfe: -509.824352 hartree
dipole: 1.3415 0.1127 3.0975
dipole: 3.3774
quadrupole: -67.5390 -54.1138 -59.9908
quadrupole: -9.5744 0.4874 2.8412
quadrupole: -6.9911 6.4340 0.5571 -9.5744 0.4874 2.8412
hfenergy: -509.9304205 hartree
pointgroup: C01 [X(C5H9N3O2)]
dipole: 0.5370618 -0.0023852 1.2154102 debye
dipolederiv: -0.5209368 0.228279 0.0571969 0.3646526 -1.293047 0.2043637 0.0443128 0.2512709 -0.4884666 -0.5722729 -0.1320527 0.2928697 0.1564181 -0.6023832 0.0381121 0.2457802 0.3157951 -0.6655446 -1.196256 -0.5245714 -0.2387007 -0.5674775 -0.5643079 -0.1583337 0.0413358 0.003056 -0.0744509 1.3527347 0.750496 0.1146643 0.8353283 0.5652436 0.083711 -0.0183631 0.0077563 -0.0960762 -0.7565797 -0.3604202 -0.0762588 -0.4205236 -0.340445 -0.0488901 -0.1061203 -0.0624696 -0.1085693 0.0150514 0.0731835 0.0870102 0.0925062 0.0049247 -0.0328445 0.1698926 -0.0757485 0.0208849 0.6561387 0.1267249 0.2210626 0.1690345 0.3352728 0.1506921 0.2286085 0.1994654 0.354742 -0.0224469 -0.0095221 0.0063503 -0.0188337 -0.0199724 0.0745238 0.0435017 0.0567741 0.018527 0.6985979 -0.0370514 -0.3794465 -0.4367849 1.3620246 -0.2575767 -0.3272889 -0.5357313 0.8229669 0.3735219 -0.1735482 0.0157208 -0.1797293 0.5064473 0.0191694 -0.0281865 0.0980397 0.2384121 0.0060289 0.0021567 -0.0670753 -0.0024868 0.0512573 -0.0099681 -0.0769685 -0.010069 -0.0691654 -0.0920872 0.0741113 0.0571907 0.0387808 -0.0358219 -0.133776 -0.0724978 -0.135107 -0.0419636 0.0430954 -0.0687835 -0.0646607 -0.0349178 -0.0652181 0.0991821 -0.1297132 0.0114777 -0.0289904 0.0645357 -0.0009578 -0.0845873 -0.0052446 0.0941717 -0.0485502 -0.1157712 -0.0155128 -0.0331484 0.0308246 0.1223461 0.0709556 0.0951153 -0.0470139 -0.0607318 0.066262 -0.108706 0.0046737 -0.0822739 -0.1153904 0.036752 -0.0803011 0.0618537 0.0251865 0.0302378 0.0442329 0.089466 0.0397227 0.0361382 -0.069574 0.0334475 0.0383623 -0.0052427 -0.0264754 -0.1045735 -0.0763397 0.094912 -0.0194987 0.0360448 0.0214818 -0.0678719 0.0788768 0.016886 0.1108348 0.0381912 -0.1323104 0.0283606 -0.0155146 -0.0604659 0.0165235 -0.0179036 0.0145675 -0.0507853 0.0948512 unknown
polarizability: 99.6208757|13.8751081|85.3250067|0.5121389|0.9407651|63.1458968 unknown
InChI: InChI=1S/C5H9N3O2/c1-4(3-7-8-6)5(9)10-2/h4H,3H2,1-2H3
charge 0 multiplicity 1
19 atoms
O  1.500918 -1.07349 0.585977
O  2.20013 0.414703 -1.05942
N  -1.467804 0.136175 -0.272554
N  -2.525378 -0.554045 -0.233041
N  -3.517623 -1.189967 -0.393062
C  0.567115 1.15311 0.665955
C  -0.784959 0.495035 1.01813
C  0.402316 2.453371 -0.144693
C  1.495712 0.169201 -0.057776
C  2.375827 -2.106377 -0.020434
H  1.0583 1.381348 1.635202
H  -1.405792 1.216797 1.586068
H  -0.620837 -0.409152 1.632233
H  -0.151217 2.254261 -1.077018
H  -0.156598 3.20295 0.444014
H  1.384221 2.874547 -0.414905
H  2.07782 -2.288781 -1.066263
H  2.225344 -3.001935 0.598305
H  3.428205 -1.776949 0.00398
