program: Gaussian 09
title: 000154006
version: EM64L-G09RevD.01
frameworkgroup: C1[X(C14H9BrN2O2S)]
method: RPBEPBE
basis: SDD
operation: Freq
keyword: #p
keyword: freq=noraman
keyword: PBEPBE/SDD
title: #p freq=noraman PBEPBE/SDD
converged: YES YES NO NO
title: Mulliken charges:
elementType: Br S O O N N C C C C C C C C C C C C C C H H H H H H H H H
charge: 0.025373 0.344911 -0.287203 -0.221020 -0.462738 0.095101 0.421789 0.357758 -0.371162 -0.360446 -0.298951 0.403979 -0.260360 -0.255231 -0.227852 -0.415829 -0.338998 -0.150000 -0.170200 -0.240065 0.351617 0.272500 0.253394 0.239947 0.240722 0.261176 0.279693 0.255940 0.256157
chargesum: 0.00000
title: Mulliken charges with hydrogens summed into heavy atoms:
elementType: Br S O O N N C C C C C C C C C C C C C C
charge: 0.025373 0.344911 -0.287203 -0.221020 -0.111121 0.095101 0.421789 0.357758 -0.371162 -0.360446 -0.026452 0.403979 -0.006966 -0.015284 0.012870 -0.154654 -0.059305 0.105939 0.085957 -0.240065
polarizability: 3.71563470e+02 2.32198697e+01 2.44905680e+02 2.15070409e+01 -9.76393541e+00 1.02923205e+02
1716.lowfreq: -3.2564 -0.0004 0.0013 0.0014 4.1486 4.3334 29.3437 36.0664 52.7278
frequency: 29.3380 36.0627 52.7249 82.1181 100.6096 131.6038 141.7146 147.5412 206.5041 209.2444 238.6337 271.1000 281.5871 324.0903 353.2183 357.4767 382.1263 410.4307 426.8303 457.5727 484.8240 492.7090 498.0633 562.9328 609.3699 623.0415 628.5260 662.6733 674.7204 685.5266 703.6913 734.4685 744.3036 770.7146 783.2912 802.5000 825.1481 833.2809 870.3079 914.0357 953.0393 959.6103 968.0960 992.1057 994.9083 1018.1983 1031.0289 1051.2830 1062.0063 1110.1214 1120.1163 1147.3057 1179.8752 1186.8641 1220.4426 1254.7662 1286.2223 1293.4912 1306.6336 1354.3195 1385.0054 1394.1771 1406.6512 1434.9541 1445.4360 1475.0737 1491.6986 1555.9558 1573.7912 1592.1928 1600.8135 1603.8167 3140.9310 3148.2256 3153.1249 3154.9212 3158.8282 3168.1069 3173.5440 3176.9236 3183.2743
redmass: 9.0358 7.8222 4.6562 8.2666 8.5942 9.6751 5.5775 11.4436 7.7803 8.2799 6.1566 8.3164 6.8650 9.4867 7.2656 9.1840 6.1305 2.9678 3.4092 10.8685 6.1762 5.5347 3.3131 6.2635 5.5059 7.0711 6.8211 8.7684 7.5681 7.8363 4.4074 2.8393 4.8109 1.5749 2.5228 1.9878 1.2650 1.7242 1.3458 3.6062 1.3699 1.3678 1.3526 4.4573 1.3498 7.5653 2.5274 6.5318 2.5621 1.7347 2.1819 1.7177 1.1306 1.1186 4.2003 1.9768 2.3422 1.5474 3.0376 5.6812 6.0954 5.5051 3.2307 2.4691 2.4033 2.6736 3.4449 4.8449 7.5082 4.2258 4.6297 4.1213 1.0862 1.0898 1.0908 1.0889 1.0779 1.0967 1.0963 1.0974 1.0974
irintensity: 1.8137 0.5467 0.6213 0.5850 0.9035 1.1991 0.6203 1.2888 1.1875 1.6456 5.4381 0.6358 9.2138 2.5404 0.2944 9.0359 7.5584 0.9701 9.6309 1.7317 8.8640 3.6254 14.0569 17.8596 15.3474 0.2728 0.8632 2.2577 8.5522 2.5859 3.7461 7.9742 29.8330 78.3576 23.8041 54.1454 0.5345 67.5972 2.3102 33.2880 4.3320 0.7913 0.2374 55.8678 0.4823 42.5375 4.2436 34.2269 37.4514 25.4415 21.4204 14.8801 17.0095 9.2596 164.7343 0.0627 42.9802 76.7922 262.2422 65.4335 52.1139 79.2502 25.0290 29.6100 48.8541 92.0618 225.8893 148.2372 25.8248 150.6888 52.3680 98.4220 0.7323 3.7063 2.6646 7.9293 87.5121 16.7613 4.5284 0.7521 6.8714
temp: 298.150 k
press: 1.00000 atm
elementType: 35 16 8 8 7 7 6 6 6 6 6 6 6 6 6 6 6 6 6 6 1 1 1 1 1 1 1 1 1
symmnumber: 1
zpe: 523082.3 jmol-1
zpe.correction: 0.199232 hartree
zpe.thermalcorrener: 0.215958 hartree
zpe.thermalcorrenthalpy: 0.216903 hartree
zpe.thermalcorrgfe: 0.152620 hartree
zpe.sumelectzpe: -1208.904414 hartree
zpe.sumelectthermal: -1208.887687 hartree
zpe.sumelectthermalent: -1208.886743 hartree
zpe.sumelectthermalfe: -1208.951026 hartree
dipole: 2.0466 5.8604 0.9136
dipole: 6.2743
quadrupole: -147.2965 -134.4068 -130.4091
quadrupole: -24.6404 1.0964 -5.5034
quadrupole: -9.9257 2.9640 6.9617 -24.6404 1.0964 -5.5034
hfenergy: -1209.1036458 hartree
pointgroup: C01 [X(C14H9Br1N2O2S1)]
dipole: -0.7102043 -2.3513663 0.2454843 debye
polarizability: 370.225396|29.1327461|246.2466595|-13.3668245|15.3925694|102.9202991 unknown
InChI: InChI=1S/C14H9BrN2O2S/c15-9-5-7-10(8-6-9)16-13-11-3-1-2-4-12(11)20-14(13)17(18)19/h1-8,16H
charge 0 multiplicity 1
29 atoms
Br -6.154023 -0.41859 -0.493353
S  3.627192 0.16008 -0.34599
O  1.273262 3.334732 0.300726
O  3.482997 3.099005 -0.317976
N  -0.220814 1.147516 0.403549
N  2.32669 2.589858 -0.02353
C  1.194078 -0.970449 0.13458
C  0.95895 0.476849 0.15948
C  2.561494 -1.29447 -0.142896
C  2.169475 1.18979 -0.033525
C  0.292039 -2.03388 0.424446
C  -1.562726 0.71704 0.20247
C  3.018444 -2.626944 -0.191029
C  0.745698 -3.363464 0.388852
C  2.098192 -3.662521 0.068042
C  -2.570633 1.260685 1.041075
C  -1.933546 -0.145355 -0.863063
C  -3.927076 0.933007 0.836859
C  -3.286691 -0.48714 -1.063757
C  -4.272446 0.052077 -0.209643
H  -0.0494 2.16669 0.555941
H  -0.747768 -1.821968 0.683517
H  4.066375 -2.854018 -0.410655
H  0.049491 -4.177288 0.614967
H  2.43378 -4.704403 0.036789
H  -2.29036 1.932998 1.858851
H  -1.174611 -0.529547 -1.55115
H  -4.698126 1.353224 1.488445
H  -3.567536 -1.148415 -1.888321
