program: Gaussian 09
title: 000153985
version: EM64L-G09RevD.01
frameworkgroup: C1[X(C14H7ClF2N4)]
method: RPBEPBE
basis: SDD
operation: Freq
keyword: #p
keyword: freq=noraman
keyword: PBEPBE/SDD
title: #p freq=noraman PBEPBE/SDD
converged: YES YES NO NO
title: Mulliken charges:
elementType: Cl F F N N N N C C C C C C C C C C C C C C H H H H H H H
charge: -0.004378 -0.175358 -0.166913 -0.050204 -0.048295 -0.100045 -0.058737 0.045019 0.433062 -0.014402 0.003569 0.249734 0.249756 -0.290268 -0.327244 -0.375430 -0.376256 -0.143472 -0.217637 -0.230459 -0.209700 0.284578 0.266082 0.266328 0.245672 0.261370 0.241930 0.241699
chargesum: 0.00000
title: Mulliken charges with hydrogens summed into heavy atoms:
elementType: Cl F F N N N N C C C C C C C C C C C C C C
charge: -0.004378 -0.175358 -0.166913 -0.050204 -0.048295 -0.100045 -0.058737 0.045019 0.433062 -0.014402 0.003569 0.249734 0.249756 -0.290268 -0.042666 -0.109348 -0.109928 0.102200 0.043733 0.011471 0.031998
polarizability: 3.52930866e+02 1.85073092e+01 1.59304623e+02 5.63575603e+00 5.06778985e+00 1.17453458e+02
1716.lowfreq: -8.7862 -3.1088 -0.0007 0.0008 0.0010 2.5947 19.9628 26.5753 40.4920
frequency: 19.8708 26.5482 40.4831 71.7880 92.2754 103.7579 157.2987 168.0043 181.1500 210.1588 231.1536 247.4653 256.8343 309.5810 342.5201 347.9402 372.8122 425.7568 432.4674 462.4948 483.4210 503.0391 537.7823 549.1058 551.1860 573.7415 601.2081 619.5086 642.5500 699.1786 723.5061 732.8845 745.0142 767.2910 787.2067 796.6439 804.4806 879.4861 879.5686 919.0626 952.0956 959.3807 966.0394 966.4922 981.1874 997.5758 1018.9589 1032.5686 1063.8652 1091.6546 1113.8269 1145.1191 1167.8520 1176.2400 1217.7490 1235.0551 1249.3598 1258.3218 1285.1614 1358.1229 1360.1190 1377.4166 1380.3190 1425.9519 1447.0545 1473.4921 1482.1281 1566.3860 1580.6524 1603.3935 1626.4640 3144.0496 3159.3660 3161.3311 3172.7165 3181.1304 3183.8103 3193.6999
redmass: 9.7158 8.2263 8.3731 9.0316 7.5117 7.3061 7.7257 14.4190 8.9468 7.8893 4.8169 13.5955 10.1656 12.5790 8.7092 5.9701 10.5942 7.2670 6.7223 4.0701 6.3526 7.0953 4.3054 7.9262 5.4624 5.2111 6.9313 10.4905 6.6754 7.7475 3.3157 3.0181 5.7837 1.3753 3.5699 3.6296 4.7524 1.3996 1.3863 13.0812 8.6542 10.0379 1.3803 1.3183 8.7819 1.3521 7.3623 3.4132 1.8420 2.3443 2.9480 2.5382 1.1365 1.0647 2.1096 6.8011 3.2155 2.5853 2.8791 7.2779 5.1503 10.9659 4.5565 2.4357 2.7698 3.1299 4.5403 6.2232 7.3439 6.8396 9.0784 1.0866 1.0909 1.0883 1.0949 1.1004 1.0931 1.0994
irintensity: 1.0050 2.2811 2.1851 1.9554 0.3759 1.3492 0.3961 0.1579 2.1077 0.3514 0.0051 0.4253 0.6604 6.6427 1.3940 2.5509 0.5104 1.0668 6.4099 11.2220 0.3478 9.7743 3.2419 11.1993 4.3139 7.1755 12.0646 1.2431 10.1214 7.9405 18.2278 22.7392 5.2362 76.4877 18.9569 28.7263 29.7099 0.0117 0.9340 19.0785 54.0697 51.9039 2.4095 1.3751 7.2126 1.1095 39.2797 26.1425 4.2535 11.0327 1.0828 5.7802 0.1468 2.9099 18.2889 8.6992 6.5003 1.4897 0.2853 28.8100 109.4702 1.1940 87.8455 61.7420 95.0156 17.7981 35.6696 10.3441 60.3900 58.9719 142.6434 2.4375 8.7913 5.1761 1.9998 17.7496 0.8267 2.8053
temp: 298.150 k
press: 1.00000 atm
elementType: 17 9 9 7 7 7 7 6 6 6 6 6 6 6 6 6 6 6 6 6 6 1 1 1 1 1 1 1
symmnumber: 1
zpe: 472838.0 jmol-1
zpe.correction: 0.180094 hartree
zpe.thermalcorrener: 0.197144 hartree
zpe.thermalcorrenthalpy: 0.198088 hartree
zpe.thermalcorrgfe: 0.132853 hartree
zpe.sumelectzpe: -1414.902762 hartree
zpe.sumelectthermal: -1414.885713 hartree
zpe.sumelectthermalent: -1414.884769 hartree
zpe.sumelectthermalfe: -1414.950003 hartree
dipole: 0.2073 -1.3708 1.2738
dipole: 1.8827
quadrupole: -71.9507 -134.3270 -127.1209
quadrupole: 6.5201 5.8355 3.2772
quadrupole: 39.1822 -23.1941 -15.9880 6.5201 5.8355 3.2772
hfenergy: -1415.0828565 hartree
pointgroup: C01 [X(C14H7Cl1F2N4)]
dipole: 0.0653751 -0.6333897 -0.3784424 debye
polarizability: 354.3957904|1.4115509|118.0780701|9.2343922|7.1930489|157.2150856 unknown
InChI: InChI=1S/C14H7ClF2N4/c15-9-5-2-1-4-8(9)13-18-20-14(21-19-13)12-10(16)6-3-7-11(12)17/h1-7H
charge 0 multiplicity 1
28 atoms
Cl -2.785161 -0.484731 2.62744
F  2.253197 -1.964899 -1.121211
F  3.170608 2.324227 0.923812
N  0.557051 0.394539 -1.386439
N  0.573894 0.982196 0.971551
N  -0.804118 0.377031 -1.359849
N  -0.790952 1.050497 0.970673
C  2.639194 0.190815 -0.096108
C  -2.896582 0.293338 -0.104179
C  1.197624 0.497195 -0.159749
C  -1.442878 0.532926 -0.13991
C  3.156963 -1.029655 -0.596905
C  3.596632 1.076051 0.460119
C  -3.617248 -0.107025 1.054641
C  -3.633255 0.466886 -1.313737
C  4.516275 -1.37286 -0.556413
C  4.968374 0.784164 0.52538
C  5.423079 -0.450879 0.012776
C  -5.013138 -0.296063 1.02339
C  -5.026095 0.280262 -1.355596
C  -5.720822 -0.093925 -0.181429
H  -3.07571 0.756505 -2.20899
H  4.842816 -2.337236 -0.953152
H  5.653358 1.517134 0.958738
H  6.488401 -0.695633 0.05562
H  -5.53459 -0.606623 1.933073
H  -5.568341 0.430187 -2.294246
H  -6.806378 -0.236024 -0.198601
