program: Gaussian 09
title: 000153948
version: EM64L-G09RevD.01
frameworkgroup: C1[X(C17H11BrFN3O4)]
method: RPBEPBE
basis: SDD
operation: Freq
keyword: #p
keyword: freq=noraman
keyword: PBEPBE/SDD
title: #p freq=noraman PBEPBE/SDD
converged: YES YES NO NO
title: Mulliken charges:
elementType: Br F O O O O N N N C C C C C C C C C C C C C C C C C H H H H H H H H H H H
charge: 0.027723 -0.187471 -0.195140 -0.157476 -0.174308 -0.224227 -0.215241 -0.191497 -0.352846 0.060219 -0.603519 0.168982 0.169984 0.291321 0.167927 0.144351 -0.187328 -0.538795 -0.359052 -0.291402 0.347678 0.181674 -0.314855 -0.313573 -0.204620 -0.194285 0.329307 0.284353 0.360083 0.265717 0.278762 0.277966 0.281289 0.258244 0.275063 0.280469 0.254523
chargesum: 0.00000
title: Mulliken charges with hydrogens summed into heavy atoms:
elementType: Br F O O O O N N N C C C C C C C C C C C C C C C C C
charge: 0.027723 -0.187471 -0.195140 -0.157476 -0.174308 -0.224227 -0.215241 -0.191497 0.007237 0.060219 0.010142 0.168982 0.169984 0.291321 0.167927 0.144351 0.078389 0.017933 -0.077763 -0.033158 0.347678 0.181674 -0.039793 -0.033104 0.049903 -0.194285
polarizability: 2.78492835e+02 -5.24218055e+00 2.27751119e+02 2.69898976e+00 -7.26933453e-01 1.79068440e+02
1716.lowfreq: -6.9074 -4.1102 -0.0006 -0.0001 0.0006 2.3885 11.0808 22.9251 27.2378
frequency: 10.2212 22.8867 27.2356 38.3236 40.5160 67.3660 88.2726 107.8098 137.9328 149.3414 152.4993 178.8254 195.9382 202.6643 247.4015 254.5638 279.3523 285.9569 292.0385 319.5466 349.3952 372.1250 385.0154 396.4515 436.5480 439.6391 466.0747 512.7924 517.8311 534.6807 552.4666 578.8151 596.0320 596.7032 604.6003 617.0119 633.6902 661.7140 673.7528 706.6720 720.3597 731.0871 740.6564 751.4689 773.4927 791.2398 829.6943 835.6688 839.0337 848.6135 856.8777 863.3581 881.1038 906.8414 911.1072 949.7831 969.0729 986.5222 1022.3877 1035.6177 1060.9976 1066.2661 1088.4479 1123.2611 1137.8114 1159.3632 1176.9803 1188.5409 1210.3572 1215.8181 1231.0931 1256.3528 1268.3322 1286.2761 1293.6215 1316.8063 1331.2506 1338.6945 1361.6260 1383.0236 1388.9749 1392.0936 1421.2229 1426.8403 1447.0152 1454.0266 1471.2173 1530.9703 1579.3433 1600.7966 1607.3927 1628.3890 1676.7214 1714.9716 3020.7542 3047.8697 3104.0929 3118.5484 3150.9867 3179.1862 3188.4494 3216.2306 3231.8756 3247.9054 3539.0711
redmass: 10.7278 8.3613 7.9460 7.9255 10.4580 8.8919 7.3438 7.6570 11.3776 8.0662 9.7039 5.5186 6.5690 10.3704 6.8441 11.9243 4.3459 6.6832 4.8765 4.4124 6.0877 3.2605 8.1401 7.1349 4.3498 3.8493 8.8540 6.2972 2.6549 5.6557 5.9192 5.2209 3.9441 5.2558 7.5053 8.3043 5.5179 5.3123 5.3683 4.3244 5.2697 5.5385 1.2753 1.4312 3.4531 4.4397 1.6281 1.5380 3.9497 5.1079 3.8097 1.4957 4.1391 1.3802 3.7630 2.2791 1.5227 3.7977 2.2718 1.8659 2.0137 1.9779 2.8639 2.2488 2.7032 3.5890 1.7261 1.6649 2.1868 2.3971 2.4098 5.5621 1.6463 2.3951 1.7862 3.4021 1.6958 2.9140 2.0488 5.9272 3.7615 2.2532 4.2778 1.0898 1.1473 3.9062 2.5173 6.6220 7.6953 10.4017 7.6701 10.7889 8.2269 12.6399 1.0639 1.0605 1.0987 1.1031 1.0900 1.0958 1.0937 1.0908 1.0981 1.1083 1.0793
irintensity: 0.0587 0.4426 0.3356 0.4019 0.4151 2.3808 0.0892 2.1728 4.2320 8.6974 0.0794 0.6331 0.0704 1.1957 0.7349 3.2659 0.8063 3.8226 6.6179 8.7089 5.0259 23.1223 29.3926 10.6154 11.7322 2.2757 2.4274 4.7878 9.7181 9.7180 0.9711 15.2924 11.3564 5.6883 0.5163 16.1278 16.3799 23.9099 26.3559 1.3536 10.8549 22.7555 72.8376 72.9778 24.7959 11.7531 25.6413 17.8427 36.0040 65.0022 5.2836 27.7429 2.7339 0.5860 8.7835 34.7531 7.7632 4.2170 18.9843 1.8678 10.6215 57.5338 138.9710 8.1495 22.8253 164.0623 20.1435 38.6600 28.7934 34.3586 94.0643 143.1544 2.6274 68.6805 8.0766 58.7602 17.0532 159.1455 25.4013 15.4798 32.1828 18.9840 26.2345 23.1265 57.2985 70.5619 114.4113 127.3748 31.6922 223.9333 56.4705 283.1840 621.8442 70.1124 14.0819 5.4072 1.8829 6.4892 0.0273 1.5908 0.6109 1.8884 0.1726 0.9457 77.0880
temp: 298.150 k
press: 1.00000 atm
elementType: 35 9 8 8 8 8 7 7 7 6 6 6 6 6 6 6 6 6 6 6 6 6 6 6 6 6 1 1 1 1 1 1 1 1 1 1 1
symmnumber: 1
zpe: 669038.8 jmol-1
zpe.correction: 0.254823 hartree
zpe.thermalcorrener: 0.276659 hartree
zpe.thermalcorrenthalpy: 0.277603 hartree
zpe.thermalcorrgfe: 0.199822 hartree
zpe.sumelectzpe: -1231.088376 hartree
zpe.sumelectthermal: -1231.066541 hartree
zpe.sumelectthermalent: -1231.065597 hartree
zpe.sumelectthermalfe: -1231.143378 hartree
dipole: -2.5351 1.5058 -2.4591
dipole: 3.8394
quadrupole: -151.4294 -166.4132 -163.0048
quadrupole: -3.7840 4.9163 -11.6743
quadrupole: 8.8530 -6.1307 -2.7223 -3.7840 4.9163 -11.6743
hfenergy: -1231.3431998 hartree
pointgroup: C01 [X(C17H11Br1F1N3O4)]
dipole: 1.0961321 -0.4794995 -0.9221262 debye
polarizability: 278.6212625|-3.5928392|227.0488857|5.1189033|4.1448893|179.6422461 unknown
InChI: InChI=1S/C17H11BrFN3O4/c18-10-4-3-9(11(19)6-10)8-21-14(24)12-2-1-5-22(12)17(16(21)26)7-13(23)20-15(17)25/h1-6,20H,7-8H2
charge 0 multiplicity 1
37 atoms
Br -6.632152 0.094868 -1.814117
F  -3.221293 1.744332 1.909227
O  -0.171245 1.736432 0.591194
O  2.977173 0.334277 2.006383
O  3.80116 3.445522 -1.410676
O  -0.20059 -2.916325 1.050559
N  2.145788 -0.745641 -0.745655
N  -0.155239 -0.573324 0.879941
N  3.589621 2.032305 0.472076
C  1.808145 0.586482 -0.226524
C  1.99262 1.725448 -1.255468
C  0.395751 0.62321 0.420388
C  2.842288 0.941222 0.927383
C  1.537241 -1.921809 -0.274768
C  3.219471 2.521732 -0.807554
C  0.374128 -1.888937 0.592471
C  3.215411 -1.089942 -1.567161
C  -1.407106 -0.492253 1.693131
C  2.21805 -3.017357 -0.836768
C  3.26899 -2.493101 -1.649336
C  -2.660378 -0.36083 0.840793
C  -3.52375 0.747315 0.963325
C  -3.033466 -1.35761 -0.096117
C  -4.692641 0.915875 0.200541
C  -4.198014 -1.236297 -0.884841
C  -5.01209 -0.093843 -0.727591
H  1.119239 2.401649 -1.215745
H  2.107099 1.366907 -2.289798
H  4.351905 2.444569 1.017294
H  3.853022 -0.338641 -2.029733
H  -1.31154 0.372374 2.366891
H  -1.439188 -1.425538 2.279794
H  1.95366 -4.059664 -0.671602
H  3.986453 -3.062015 -2.23738
H  -2.405325 -2.24862 -0.198752
H  -5.316215 1.801774 0.34039
H  -4.468083 -2.017347 -1.599994
