program: Gaussian 09
title: 000153933
version: EM64L-G09RevD.01
frameworkgroup: C1[X(C11H15N3O3)]
method: RPBEPBE
basis: SDD
operation: Freq
keyword: #p
keyword: freq=noraman
keyword: PBEPBE/SDD
title: #p freq=noraman PBEPBE/SDD
converged: YES YES NO NO
title: Mulliken charges:
elementType: O O O N N N C C C C C C C C C C C H H H H H H H H H H H H H H H
charge: -0.251389 -0.412732 -0.241057 -0.651721 -0.398007 -0.371833 -0.369039 -0.162748 -0.526128 0.240399 0.158083 0.457954 -0.417594 -0.345994 -0.197748 -0.208579 -0.265794 0.231555 0.255735 0.253511 0.276221 0.214424 0.316248 0.285365 0.315527 0.306566 0.221709 0.236273 0.222041 0.219716 0.225775 0.383261
chargesum: 0.00000
title: Mulliken charges with hydrogens summed into heavy atoms:
elementType: O O O N N N C C C C C C C C C C C
charge: -0.251389 -0.029471 -0.241057 -0.050107 -0.082480 -0.065267 0.118251 0.090763 -0.035483 0.240399 0.158083 0.457954 -0.195885 -0.109721 0.024292 0.011137 -0.040019
polarizability: 2.00448772e+02 -8.09147717e+00 1.45239526e+02 1.78576614e+01 -4.09736844e+00 1.03758629e+02
1716.lowfreq: -11.6874 -8.3181 -0.0004 -0.0003 -0.0001 3.2779 10.4800 18.7263 31.3410
frequency: 9.8594 18.4223 31.1046 39.3909 52.0494 62.0935 103.0283 140.4941 173.9330 204.2671 229.4573 245.2334 267.2835 292.4814 315.3708 349.8334 405.7961 438.5414 448.5172 476.3069 485.9710 513.0894 527.4332 532.2418 560.7217 594.0005 612.9856 630.3506 658.4236 687.4931 692.7169 746.4828 756.6520 785.0361 814.9498 824.4194 835.4530 885.2026 936.4157 943.2274 958.9713 978.7113 981.5759 996.6275 1021.6240 1048.2619 1064.3539 1079.4939 1102.9890 1134.2140 1169.1740 1179.4223 1180.6015 1191.3176 1218.3374 1238.3950 1265.2710 1280.6042 1296.2997 1313.1017 1335.5474 1363.3966 1379.0595 1384.2564 1431.3111 1445.7275 1450.1654 1469.1015 1485.3514 1498.5421 1599.7946 1604.0885 1615.5148 1630.2584 1663.3641 2878.2397 2960.3341 3015.9096 3023.0911 3083.4081 3117.7677 3127.4855 3140.8255 3155.3383 3168.1728 3497.4147 3498.1020 3515.9603 3519.8941 3640.1758
redmass: 4.8310 5.7697 4.2628 8.0727 8.5258 5.6132 3.4769 4.7673 3.7387 4.4244 2.3830 1.3360 3.2391 3.9229 3.2318 2.8214 2.8935 2.0925 3.9051 3.1971 2.4044 2.6456 1.7995 1.9740 1.9664 2.1484 6.2503 1.5848 4.3322 4.1888 1.9763 3.1604 1.7620 1.7038 2.9440 1.3703 3.5798 1.4848 2.6647 5.7727 1.3674 1.3014 5.8527 1.9355 2.1500 2.8559 2.6752 1.7119 1.6223 1.9763 1.0515 1.1917 1.1856 1.6860 2.0008 1.7318 1.4950 1.4660 2.4851 1.4252 1.4905 1.6227 1.7636 4.6007 2.1082 1.7209 1.1071 1.0970 2.4660 1.4581 5.3583 1.3578 6.3705 6.3486 3.5453 1.0800 1.0590 1.0615 1.0986 1.1031 1.0865 1.0865 1.0929 1.0943 1.1009 1.0765 1.0457 1.0784 1.0641 1.0998
irintensity: 0.3445 0.0402 0.2205 3.0512 3.0580 2.3021 2.9741 4.9052 4.9585 3.4824 21.7440 24.9751 0.2679 10.6279 3.8734 13.7259 0.3906 61.4528 17.6731 21.4736 67.4503 57.9177 124.5655 84.6724 23.0113 99.6995 2.5228 167.9415 23.1256 22.9378 42.6955 4.7138 84.1853 16.1433 0.8460 0.4592 10.5934 8.7630 10.4095 3.7908 0.2066 0.5830 0.5582 3.9792 6.9011 175.9000 95.2316 3.5213 43.7347 27.5127 1.6785 15.6174 2.7397 9.6387 35.8990 99.5553 23.8138 11.6628 12.7229 5.3499 21.3857 10.8880 5.0876 21.6996 31.7652 128.1372 6.7750 18.6480 99.5266 25.6992 16.8072 195.7555 141.2382 108.2275 139.6213 57.8060 34.4158 16.4445 21.5296 14.8495 10.6164 1.0169 27.1439 35.9533 14.1506 15.0867 16.0522 36.6260 30.7838 17.8636
temp: 298.150 k
press: 1.00000 atm
elementType: 8 8 8 7 7 7 6 6 6 6 6 6 6 6 6 6 6 1 1 1 1 1 1 1 1 1 1 1 1 1 1 1
symmnumber: 1
zpe: 668256.0 jmol-1
zpe.correction: 0.254525 hartree
zpe.thermalcorrener: 0.271907 hartree
zpe.thermalcorrenthalpy: 0.272851 hartree
zpe.thermalcorrgfe: 0.205092 hartree
zpe.sumelectzpe: -816.806139 hartree
zpe.sumelectthermal: -816.788758 hartree
zpe.sumelectthermalent: -816.787814 hartree
zpe.sumelectthermalfe: -816.855573 hartree
dipole: 1.7944 1.3090 0.9333
dipole: 2.4092
quadrupole: -96.1579 -90.2563 -103.9572
quadrupole: 2.8623 -7.3847 -1.4086
quadrupole: 0.6326 6.5342 -7.1667 2.8623 -7.3847 -1.4086
hfenergy: -817.0606646 hartree
pointgroup: C01 [X(C11H15N3O3)]
dipole: -0.7066201 -0.5554415 0.3010235 debye
polarizability: 199.8484277|-5.855904|143.3933757|-19.9654393|9.8993137|106.2051235 unknown
InChI: InChI=1S/C11H15N3O3/c12-9(11(16)17)6-7-10(15)14-13-8-4-2-1-3-5-8/h1-5,9,13-14,16H,6-7,12H2
charge 0 multiplicity 1
32 atoms
O  -0.002321 1.88216 -0.665429
O  -3.951575 -2.067677 -0.295581
O  -5.279165 -0.839002 1.156991
N  -4.547915 1.542847 -0.004191
N  0.605821 0.576611 1.159812
N  1.935875 1.022283 1.172047
C  -2.510324 0.368684 -0.860451
C  -4.054858 0.328804 -0.654974
C  -1.754571 0.561484 0.468252
C  -0.329935 1.060163 0.239016
C  -4.498073 -0.871652 0.179741
C  2.939343 0.266513 0.502176
C  4.225572 0.849464 0.337723
C  2.711028 -1.061061 0.057849
C  5.262208 0.111632 -0.267426
C  3.760867 -1.789804 -0.542754
C  5.041476 -1.215044 -0.709909
H  -2.185629 -0.55188 -1.376337
H  -2.270258 1.224264 -1.518432
H  -4.500065 0.151667 -1.665162
H  -2.309847 1.332249 1.043226
H  -1.754868 -0.369953 1.068061
H  -5.334489 1.408356 0.635316
H  -4.597663 2.373021 -0.594363
H  0.307485 0.010394 1.957752
H  2.016317 2.041671 1.101258
H  4.408215 1.874641 0.683288
H  1.717048 -1.506362 0.164783
H  6.24742 0.575084 -0.393406
H  3.571751 -2.813119 -0.887465
H  5.850154 -1.785605 -1.178206
H  -4.303327 -2.825733 0.245194
