program: Gaussian 09
title: 000153926
version: EM64L-G09RevD.01
frameworkgroup: C1[X(C25H26N2O4)]
method: RPBEPBE
basis: SDD
operation: Freq
keyword: #p
keyword: freq=noraman
keyword: PBEPBE/SDD
title: #p freq=noraman PBEPBE/SDD
converged: YES YES NO NO
title: Mulliken charges:
elementType: O O O O N N C C C C C C C C C C C C C C C C C C C C C C C C C H H H H H H H H H H H H H H H H H H H H H H H H H H
charge: -0.293746 -0.293946 -0.293769 -0.293493 -0.006619 -0.007584 0.321342 -0.527104 -0.537161 -0.014261 -0.097291 -0.086440 -0.736140 -0.748609 0.319027 0.325010 0.327366 -0.109500 -0.113073 -0.490500 -0.486730 -0.529519 -0.529534 0.158610 0.156885 0.228306 0.228246 -0.530516 -0.530363 -0.529383 -0.529289 0.245165 0.234587 0.234485 0.244364 0.213735 0.234895 0.213266 0.219228 0.218795 0.209946 0.274506 0.274404 0.289713 0.289489 0.254935 0.225699 0.232044 0.254599 0.225751 0.232064 0.255135 0.226824 0.232036 0.232075 0.255249 0.226789
chargesum: 0.00000
title: Mulliken charges with hydrogens summed into heavy atoms:
elementType: O O O O N N C C C C C C C C C C C C C C C C C C C C C C C C C
charge: -0.293746 -0.293946 -0.293769 -0.293493 -0.006619 -0.007584 0.321342 -0.047352 -0.058312 -0.014261 -0.097291 -0.086440 -0.074244 -0.100639 0.319027 0.325010 0.327366 -0.109500 -0.113073 -0.215994 -0.212326 -0.239806 -0.240046 0.158610 0.156885 0.228306 0.228246 0.182162 0.182051 0.184612 0.184824
polarizability: 4.37736367e+02 1.75592500e+00 4.21443600e+02 1.32538557e+01 -8.64897406e+00 1.79520639e+02
1716.lowfreq: -6.0613 -5.2767 -0.0010 -0.0008 -0.0008 0.6300 31.2946 34.9176 43.9582
frequency: 31.2150 34.9002 43.9461 48.1292 68.1291 74.3295 80.7563 106.1151 109.8344 120.0040 124.7330 134.3290 154.5184 158.8107 160.8711 167.7008 171.7762 184.6848 198.9781 204.5484 211.0553 226.5900 242.6326 249.7234 258.9105 265.3222 271.6236 278.7926 290.2171 304.6393 320.5409 343.3741 351.0656 378.9411 384.5402 394.7136 411.7338 425.8072 452.8360 472.1186 479.2895 495.9752 502.8678 521.0569 529.3227 571.7857 583.6378 598.7964 622.9880 639.0568 654.4164 680.0463 694.8339 708.4338 711.8637 727.3900 732.2527 743.9813 757.6912 759.4464 787.1430 822.5028 839.8196 877.8472 879.6662 886.2135 901.9889 905.8192 906.5374 922.8359 928.8609 933.3033 939.0579 941.3009 952.9008 968.4250 988.1003 1007.7987 1060.6963 1077.3798 1103.1932 1112.1618 1113.6017 1115.1409 1115.6855 1129.7889 1140.0716 1142.2746 1148.8810 1150.3993 1156.5604 1159.5784 1167.2880 1170.6453 1190.5861 1217.8288 1222.5122 1234.8156 1259.8938 1262.0210 1274.0997 1291.2476 1299.1106 1300.7189 1328.8183 1336.8077 1370.8097 1379.9927 1394.8195 1400.4592 1401.4844 1414.0852 1415.0596 1418.7412 1424.2089 1436.8447 1441.4299 1446.9749 1449.6546 1450.5983 1458.3621 1458.5849 1459.9403 1462.3047 1463.2905 1470.3654 1476.9627 1477.5806 1481.1857 1482.4269 1484.5314 1486.7143 1487.5643 1493.6431 1529.8743 1541.6345 1557.6059 1615.4439 1623.2803 2954.4858 2956.9576 2965.4423 2974.3849 2974.5249 2975.6312 2976.0083 2976.4522 3048.0942 3051.7872 3061.5304 3064.3302 3071.2303 3072.0049 3072.3060 3073.6467 3073.9102 3075.6646 3124.8638 3125.0872 3125.2776 3125.8723 3177.7098 3179.0045 3180.1617 3191.2472
redmass: 3.8023 4.3657 3.8001 3.7055 3.6253 3.9897 3.6338 2.7682 2.7760 4.0735 3.6192 3.5232 1.3271 1.1540 1.2806 1.6063 1.1583 1.0967 2.5899 3.5076 4.2811 1.2959 5.4349 5.1906 2.1793 5.3056 4.6589 5.2519 4.2236 5.1376 6.0486 3.5334 3.2452 3.1359 5.5336 3.3809 3.1900 4.3554 4.3268 4.7299 4.1961 4.5438 4.5141 5.3300 5.1391 5.6687 6.0931 5.4510 7.9426 5.6318 5.4777 5.2084 7.2148 5.9981 6.1348 7.0619 3.4761 5.6117 4.0791 5.6968 3.9593 4.8664 5.0683 4.7273 1.7341 1.7254 1.7816 3.0804 1.5441 2.6942 1.5336 3.1171 1.5628 2.7110 4.9491 3.3608 1.9466 1.3923 3.8568 4.7414 3.7124 1.2599 1.2465 1.2508 1.2844 1.5890 1.9725 1.4368 1.5155 1.3483 1.5382 1.6168 2.1578 1.9940 3.1888 1.3540 2.5882 4.0551 2.6754 1.9577 1.7777 3.1774 2.7319 5.0990 2.0657 5.6392 5.3304 1.2071 2.0863 2.0516 2.8910 2.2562 3.3043 1.6915 1.2184 1.4253 1.4723 1.0922 1.8539 1.8842 1.0652 1.0593 1.0807 1.1351 1.0517 1.0660 1.0569 1.0567 1.0877 3.0908 1.0642 1.0929 1.0803 5.1653 9.2721 8.9946 11.3163 7.3775 7.4031 1.0668 1.0649 1.0361 1.0307 1.0307 1.0365 1.0308 1.0311 1.0928 1.0940 1.0991 1.0997 1.0986 1.1041 1.1041 1.1043 1.1043 1.0988 1.1029 1.1029 1.1028 1.1028 1.0915 1.0923 1.0923 1.0896
irintensity: 0.1001 0.0730 2.8817 0.0704 0.0567 0.9487 3.5024 10.2099 11.2893 0.1587 6.1940 1.3723 0.7832 0.1189 0.4721 0.8798 0.2253 0.5304 2.5778 4.4164 3.6783 0.6797 16.2239 4.3790 1.5755 5.8697 4.3339 2.1350 0.1653 0.5927 4.1665 3.3011 1.3770 2.7425 11.3708 0.2761 5.7424 10.0402 0.6261 2.9696 6.8539 0.2427 2.9695 1.7135 3.1899 9.0185 27.6576 26.6665 2.2782 2.1969 2.4143 3.5547 1.9833 7.2958 7.4079 1.4014 13.4380 19.3365 4.1106 4.4878 0.8655 1.0272 0.8537 1.4330 7.7648 2.0851 2.5395 2.5246 46.8657 50.7146 31.1127 7.5905 8.7305 58.6963 112.0600 74.7148 34.7828 1.5549 2.9963 3.7646 145.9534 27.6674 31.1913 8.5218 2.5496 12.5608 4.6178 4.6056 9.4438 8.3103 26.8858 10.2895 1.7265 33.7495 77.9280 12.0725 64.0982 187.3559 13.2835 150.0043 6.2081 17.5386 25.6925 42.4821 23.0557 22.6554 0.5448 18.6425 5.1926 25.9518 64.0822 0.8691 0.3333 63.3375 5.4540 76.8487 43.7882 15.1068 66.7665 1.9978 20.5295 19.9816 19.1934 16.3000 0.5954 16.7396 7.9700 5.5376 26.3663 265.4802 15.5190 29.8775 43.3778 113.8501 0.2466 58.7971 95.8637 36.9047 0.9011 7.3347 28.0436 56.8843 23.5667 136.1907 38.5998 92.0357 71.4566 6.8240 7.1108 42.0033 5.3590 56.1167 28.0146 35.0030 18.3613 18.5122 64.1897 15.1929 20.9441 35.6092 27.0069 0.6749 0.5720 2.7115 4.2777
temp: 298.150 k
press: 1.00000 atm
elementType: 8 8 8 8 7 7 6 6 6 6 6 6 6 6 6 6 6 6 6 6 6 6 6 6 6 6 6 6 6 6 6 1 1 1 1 1 1 1 1 1 1 1 1 1 1 1 1 1 1 1 1 1 1 1 1 1 1
symmnumber: 1
zpe: 1192106.4 jmol-1
zpe.correction: 0.454049 hartree
zpe.thermalcorrener: 0.483511 hartree
zpe.thermalcorrenthalpy: 0.484455 hartree
zpe.thermalcorrgfe: 0.394992 hartree
zpe.sumelectzpe: -1376.390553 hartree
zpe.sumelectthermal: -1376.361092 hartree
zpe.sumelectthermalent: -1376.360148 hartree
zpe.sumelectthermalfe: -1376.449611 hartree
dipole: 0.3192 -2.7335 0.1686
dipole: 2.7573
quadrupole: -175.7267 -160.0981 -173.4150
quadrupole: -1.7400 1.6291 -0.4245
quadrupole: -5.9802 9.6485 -3.6684 -1.7400 1.6291 -0.4245
hfenergy: -1376.8446027 hartree
pointgroup: C01 [X(C25H26N2O4)]
dipole: -0.0480204 -1.0816205 -0.0675575 debye
polarizability: 438.4099299|-0.2834663|421.2274449|5.2713897|10.1832367|179.0632307 unknown
InChI: InChI=1S/C25H26N2O4/c1-25(2)11-17-24-18(12-25)27-16-10-22(31-6)20(29-4)8-14(16)23(24)13-7-19(28-3)21(30-5)9-15(13)26-17/h7-10H,11-12H2,1-6H3
charge 0 multiplicity 1
57 atoms
O  -3.071106 -3.444478 0.56718
O  2.750258 -3.599179 -0.815747
O  -5.322606 -1.679228 -0.058824
O  5.149191 -2.109863 -0.037554
N  -2.356817 2.109039 -0.028278
N  2.506988 1.877039 0.47216
C  0.262092 4.786434 -0.191164
C  -1.089878 4.17146 0.266928
C  1.393312 4.046541 0.577103
C  0.06656 1.870757 0.246006
C  -1.149787 2.658829 0.156727
C  1.344675 2.538234 0.416019
C  0.446037 4.621145 -1.722718
C  0.292715 6.290757 0.168742
C  0.008421 0.441899 0.141618
C  -1.31742 -0.166671 0.148191
C  1.27949 -0.266995 0.038538
C  -2.458437 0.717012 0.002446
C  2.49178 0.496069 0.267068
C  -1.590166 -1.553521 0.366099
C  1.434235 -1.633288 -0.354993
C  -3.773111 0.174211 -0.097197
C  3.758755 -0.157483 0.264469
C  -2.891135 -2.063153 0.329189
C  2.688792 -2.246919 -0.409676
C  -3.999654 -1.197227 0.024338
C  3.869525 -1.517074 -0.029068
C  -3.901566 -3.766988 1.753563
C  3.529401 -3.8416 -2.054831
C  -5.556307 -2.677715 -1.130339
C  5.315908 -3.250002 0.896437
H  -1.938684 4.590662 -0.302372
H  -1.261197 4.444938 1.330348
H  1.306077 4.288349 1.658103
H  2.391475 4.394268 0.256662
H  1.41435 5.046553 -2.045919
H  0.424461 3.560157 -2.029979
H  -0.358471 5.147055 -2.269757
H  1.251632 6.749563 -0.137069
H  -0.521332 6.836208 -0.344691
H  0.1724 6.446476 1.257948
H  -0.802778 -2.252891 0.652219
H  0.588389 -2.226503 -0.706242
H  -4.609909 0.858039 -0.259629
H  4.651032 0.431616 0.490292
H  -4.900447 -3.301552 1.676259
H  -3.394403 -3.419383 2.673209
H  -3.983614 -4.864204 1.761948
H  4.564941 -3.471268 -1.951006
H  3.036595 -3.345896 -2.912267
H  3.519444 -4.932797 -2.196019
H  -4.880871 -3.544749 -1.019649
H  -5.407176 -2.207193 -2.120177
H  -6.606225 -2.986197 -1.015861
H  6.336404 -3.622011 0.720987
H  4.572219 -4.04136 0.694509
H  5.217245 -2.897322 1.940122
