program: Gaussian 09
title: 000153924
version: EM64L-G09RevD.01
frameworkgroup: C1[X(C16H8Cl2N2)]
method: RPBEPBE
basis: SDD
operation: Freq
keyword: #p
keyword: freq=noraman
keyword: PBEPBE/SDD
title: #p freq=noraman PBEPBE/SDD
converged: YES YES NO NO
title: Mulliken charges:
elementType: Cl Cl N N C C C C C C C C C C C C C C C C H H H H H H H H
charge: -0.035396 -0.035396 -0.010073 -0.010073 0.277916 0.290900 0.290900 0.305276 -0.057258 -0.057259 -0.348527 -0.348528 -0.530806 -0.530806 -0.286415 -0.286415 -0.254409 -0.254409 -0.118150 -0.118149 0.247648 0.247649 0.256309 0.256309 0.293142 0.293142 0.261438 0.261438
chargesum: 0.00000
title: Mulliken charges with hydrogens summed into heavy atoms:
elementType: Cl Cl N N C C C C C C C C C C C C C C C C
charge: -0.035396 -0.035396 -0.010073 -0.010073 0.277916 0.290900 0.290900 0.305276 -0.057258 -0.057259 -0.100879 -0.100879 -0.274498 -0.274498 0.006727 0.006728 0.007030 0.007030 -0.118150 -0.118149
polarizability: 3.76299283e+02 -3.21627756e-05 2.38766369e+02 -6.03990016e+00 -6.88340565e-05 7.83586835e+01
1716.lowfreq: -7.8123 -0.0021 0.0025 0.0025 2.3559 4.8807 43.7403 61.1886 68.7683
frequency: 43.6945 61.1860 68.7683 134.2255 142.3189 184.1688 195.3675 221.2636 223.7617 289.7195 307.6273 319.2070 346.0322 398.4598 421.8415 446.8575 469.2698 483.0537 490.5715 513.3544 536.5482 546.6391 558.3004 611.4711 619.5876 645.5532 670.6184 687.1433 711.4922 766.7051 785.6171 794.4408 826.7613 827.3488 835.3479 867.6733 891.2936 900.8568 912.0378 936.0250 948.6347 959.3532 972.4668 1023.5799 1066.2169 1072.6324 1120.9186 1136.4863 1169.0751 1197.6534 1215.6869 1226.4009 1259.8605 1285.9995 1319.8914 1351.2648 1353.0463 1390.4892 1394.5458 1394.7224 1410.4641 1430.3903 1445.1733 1471.1239 1516.2851 1552.1677 1561.5197 1563.6027 1599.4763 1605.6947 3108.9649 3113.1963 3162.4118 3165.5841 3182.8867 3185.5596 3186.1928 3193.1623
redmass: 7.3424 10.5142 7.9541 7.9893 5.8212 8.7282 5.0920 6.4474 9.9538 10.5986 10.4629 7.3620 6.6272 5.2957 3.3571 3.2764 6.0377 7.4657 4.7339 5.7891 4.3250 5.3477 6.0235 6.7253 4.9959 7.5894 3.5633 7.2555 8.1654 4.1768 1.8588 4.7704 6.6545 1.4012 2.9415 6.5396 1.3728 1.5344 1.4429 6.4147 1.3716 1.5949 1.3035 5.6719 1.9164 1.9828 2.8854 1.7520 3.5443 1.8994 2.1077 1.5580 1.5189 1.6119 5.8881 2.5717 2.2214 6.5385 4.0568 2.1391 5.8461 4.8002 3.4329 2.9047 5.4523 9.0538 7.4279 7.4302 7.1347 7.1660 1.0910 1.0916 1.0885 1.0896 1.0963 1.0933 1.0943 1.0940
irintensity: 1.1551 0.0016 0.2645 0.0369 1.7672 0.1594 0.0001 0.6532 0.5888 1.0649 2.1136 0.0609 0.1483 28.3647 16.3283 0.1583 5.4904 5.7179 4.8405 2.2645 5.2132 7.4792 0.1212 0.0486 0.3106 1.7794 18.1221 4.3174 0.6023 2.2242 49.8270 22.3125 124.7515 2.6167 29.4241 32.2881 0.1160 38.4741 0.6662 19.3811 2.6423 25.4168 0.0641 11.7675 40.5436 1.0224 1.5854 17.2375 52.9565 9.3557 2.4373 4.1075 18.6718 2.8640 1.5187 0.7260 11.0504 0.7907 41.8754 1.8478 53.3063 0.9084 21.6721 71.9376 22.2820 0.0201 15.9370 170.0602 103.9645 43.0776 0.3543 33.2029 0.6037 0.1137 1.1938 0.5616 0.4749 7.3638
temp: 298.150 k
press: 1.00000 atm
elementType: 17 17 7 7 6 6 6 6 6 6 6 6 6 6 6 6 6 6 6 6 1 1 1 1 1 1 1 1
symmnumber: 1
zpe: 508442.8 jmol-1
zpe.correction: 0.193656 hartree
zpe.thermalcorrener: 0.208433 hartree
zpe.thermalcorrenthalpy: 0.209377 hartree
zpe.thermalcorrgfe: 0.150880 hartree
zpe.sumelectzpe: -1642.813302 hartree
zpe.sumelectthermal: -1642.798525 hartree
zpe.sumelectthermalent: -1642.797581 hartree
zpe.sumelectthermalfe: -1642.856078 hartree
dipole: 0.0000 -1.3351 0.0000
dipole: 1.3351
quadrupole: -149.9204 -119.3677 -131.4077
quadrupole: 0.0000 1.7793 0.0000
quadrupole: -16.3551 14.1976 2.1576 0.0000 1.7793 0.0000
hfenergy: -1643.0069576 hartree
pointgroup: C01 [X(C16H8Cl2N2)]
dipole: -0.0000035 -0.5252639 0.0000158 debye
polarizability: 376.2831771|-0.0008547|238.7663687|-6.4248642|-0.0046268|78.37479 unknown
InChI: InChI=1S/C16H8Cl2N2/c17-10-1-3-12-14(5-10)19-7-9-8-20-15-6-11(18)2-4-13(15)16(9)12/h1-8H
charge 0 multiplicity 1
28 atoms
Cl -5.589862 -1.985147 -0.008991
Cl 5.589845 -1.985198 0.009116
N  -2.432691 2.100284 0.284176
N  2.43271 2.100245 -0.28428
C  0.000002 0.523046 -0.000003
C  -1.307549 -0.12585 -0.043871
C  1.307548 -0.125859 0.043902
C  0.000009 1.954726 -0.000047
C  -2.4806 0.705553 0.15813
C  2.480606 0.705522 -0.158151
C  -1.534494 -1.507685 -0.346877
C  1.534481 -1.507679 0.346987
C  -1.238446 2.676485 0.150089
C  1.23847 2.676465 -0.150227
C  -3.784477 0.12606 0.192008
C  3.784479 0.126015 -0.191999
C  -2.819166 -2.063984 -0.347157
C  2.819149 -2.06399 0.347296
C  -3.93263 -1.238621 -0.039888
C  3.93262 -1.238654 0.039976
H  -0.70571 -2.146991 -0.655591
H  0.705693 -2.146959 0.655741
H  -1.212807 3.773578 0.184114
H  1.212841 3.773556 -0.18432
H  -4.633262 0.789837 0.371899
H  4.633269 0.789773 -0.371931
H  -2.96931 -3.117567 -0.598761
H  2.969283 -3.11756 0.59896
