program: Gaussian 09
title: 000153918
version: EM64L-G09RevD.01
frameworkgroup: C1[X(C23H26N2O2)]
method: RPBEPBE
basis: SDD
operation: Freq
keyword: #p
keyword: freq=noraman
keyword: PBEPBE/SDD
title: #p freq=noraman PBEPBE/SDD
converged: YES YES NO NO
title: Mulliken charges:
elementType: O O N N C C C C C C C C C C C C C C C C C C C C C C C H H H H H H H H H H H H H H H H H H H H H H H H H H
charge: -0.500700 -0.453417 -0.240614 -0.375257 0.214579 0.058620 0.173031 0.206203 0.251940 0.510094 -0.547461 -0.645586 0.280560 -0.389537 -0.339360 -0.428553 -0.395079 0.401700 -0.352439 -0.331165 -0.719824 -0.485421 -0.389640 -0.664401 -0.456234 -0.263907 -0.254289 0.228742 0.193902 0.237552 0.260588 0.224637 0.224869 0.218231 0.264611 0.233846 0.199470 0.220644 0.225983 0.166931 0.188429 0.251209 0.233406 0.236906 0.222817 0.236084 0.216832 0.233757 0.238240 0.224945 0.226090 0.361051 0.366381
chargesum: 0.00000
title: Mulliken charges with hydrogens summed into heavy atoms:
elementType: O O N N C C C C C C C C C C C C C C C C C C C C C C C
charge: -0.139649 -0.087036 -0.240614 -0.114669 0.214579 0.058620 0.173031 0.206203 0.251940 0.510094 -0.124818 -0.408034 0.280560 0.059969 -0.121128 -0.163942 -0.161233 0.401700 0.067675 0.061750 -0.046779 -0.248514 -0.166823 0.022272 -0.217993 -0.038962 -0.028198
polarizability: 4.50323321e+02 2.95978496e+01 3.10431248e+02 -7.15013962e+00 -9.33929405e+00 1.45518408e+02
1716.lowfreq: -8.6127 -6.0408 0.0004 0.0006 0.0010 2.3291 8.5907 19.3484 33.9132
frequency: 5.5555 19.2273 33.8467 42.2341 56.0596 70.2613 78.1928 92.8519 103.1638 126.9474 137.5743 159.4287 169.1309 189.1680 194.8010 205.5269 228.5033 242.8101 251.9153 266.7410 275.6622 280.6544 299.9309 330.9304 336.9281 351.6411 384.7206 398.0420 414.7382 425.5136 431.6579 446.6538 452.4613 486.8135 520.2413 526.9354 535.5264 560.2022 569.5688 588.2571 604.9709 614.4070 623.8935 646.6425 676.7866 691.3288 695.1753 737.2729 749.8209 751.3128 761.1890 799.5960 802.4717 808.5756 825.5153 829.7731 859.5259 864.1004 877.4069 898.9312 929.2355 940.8978 943.2962 944.3452 948.3154 957.1445 958.7578 964.9104 969.1283 983.9236 985.2956 996.0798 1011.1381 1031.7228 1071.6171 1086.0418 1099.2098 1121.1479 1139.1477 1140.2989 1149.9103 1152.5586 1155.4062 1157.9857 1174.2106 1188.7370 1205.0159 1217.1603 1223.4407 1235.9843 1246.3605 1261.8270 1268.7003 1285.2152 1299.3666 1321.4323 1331.7016 1340.7937 1344.7612 1362.3980 1378.4972 1385.8877 1389.9199 1397.3598 1398.3486 1404.7362 1416.3590 1424.6776 1444.7257 1452.4054 1459.6784 1460.3580 1462.3599 1464.6492 1467.6574 1475.9163 1477.9446 1481.2066 1484.4375 1489.9804 1493.9599 1536.2519 1568.1030 1573.7688 1596.7977 1629.6079 1630.9998 2857.9778 2921.6467 2947.2181 2979.0434 2988.7718 2995.8486 3006.4089 3009.5714 3055.4329 3071.5525 3075.8567 3087.6020 3097.1896 3118.0972 3119.2699 3122.8242 3125.6428 3132.3698 3145.7638 3150.6708 3155.2945 3167.3045 3180.6296 3403.2600 3478.5152 3583.5207
redmass: 3.6402 4.8829 5.2535 2.7082 3.8320 3.8432 3.0608 3.7260 4.5943 4.3980 3.6751 2.1375 4.0972 1.3318 1.3936 3.6478 3.2744 2.4215 1.8369 1.4950 4.3590 3.9604 2.4799 4.0476 3.0209 3.1526 5.2955 4.9191 3.0580 2.3809 3.3406 3.2007 2.6137 5.1079 5.7772 3.1902 2.1159 3.0392 3.4502 3.6651 2.5424 4.3091 1.4711 3.8709 5.2821 3.2604 4.7673 3.1439 2.6345 1.3607 2.9880 1.8467 2.5820 1.4404 3.0264 1.7861 1.9141 2.4239 1.8576 1.9340 1.4961 2.1633 1.5664 1.7666 4.0156 4.9491 1.4121 1.3862 2.1876 2.7697 1.3495 2.4667 2.8732 2.3126 3.1131 2.1216 2.6978 1.7817 1.4970 1.4182 1.7570 1.3587 1.4308 1.8177 1.1333 1.8099 1.5179 1.2798 2.2082 2.0244 1.7691 1.7779 1.4889 1.5947 1.5651 2.1064 1.2991 1.6029 1.5056 1.9346 1.2884 2.6779 1.3173 1.7538 2.1216 3.3383 1.1802 3.9955 3.4941 1.1786 2.6642 1.1020 1.1266 2.0378 1.3017 1.0997 1.1117 1.0978 1.1476 3.1311 1.1332 4.8230 6.8372 7.0730 6.8768 6.8336 7.3341 1.0717 1.0696 1.0545 1.0407 1.0355 1.0851 1.0605 1.1082 1.1026 1.0934 1.0949 1.0995 1.1019 1.0866 1.0982 1.0908 1.0868 1.0894 1.0874 1.0972 1.0964 1.0968 1.0934 1.0654 1.0754 1.0670
irintensity: 1.5630 0.9507 0.8706 0.4366 1.1146 1.7303 2.2892 0.0452 0.4345 0.9465 0.4176 4.8455 0.7158 1.8280 1.8058 2.9617 1.3573 19.4617 64.9982 44.2467 4.1089 5.0270 1.6298 3.2623 3.5224 8.7351 2.6570 0.3038 7.0990 0.4425 2.5844 12.7663 19.0397 0.8032 2.2663 15.2357 73.4853 14.9924 2.5465 3.1649 23.4816 7.7221 148.2164 20.9823 0.1530 6.6821 2.7497 17.1164 5.9136 36.8939 3.8472 2.5251 1.3922 34.2324 22.3736 75.5107 5.3849 8.8433 1.8153 7.9531 1.0746 6.2431 0.9976 15.3814 7.3413 79.9266 3.0689 2.7265 2.8804 4.1132 0.4308 150.5826 40.5341 9.2265 3.8795 10.2443 6.7012 7.4673 67.5893 3.1466 10.9516 1.5568 40.4740 11.6645 1.1137 12.5573 36.3218 10.0038 2.7319 26.7283 22.6354 5.9115 6.3006 6.7720 0.9374 66.1626 6.4492 52.0090 17.2611 45.7924 16.3019 17.2351 22.6173 5.0579 11.6798 66.0299 68.7269 10.1717 14.0760 25.8027 14.9874 3.5433 4.3307 32.0409 2.0301 16.2654 4.8482 4.2186 31.2156 18.1366 21.3790 30.2503 4.5606 0.5085 32.1480 25.8803 28.4007 72.2656 98.8500 68.3170 25.0648 25.4969 15.4537 41.3203 66.5038 4.2171 18.1550 39.1955 48.3754 26.0156 4.4766 15.7750 18.0069 3.6758 13.8018 8.7434 30.1897 42.9642 1.0928 24.8788 116.9427 0.9588 1.8922
temp: 298.150 k
press: 1.00000 atm
elementType: 8 8 7 7 6 6 6 6 6 6 6 6 6 6 6 6 6 6 6 6 6 6 6 6 6 6 6 1 1 1 1 1 1 1 1 1 1 1 1 1 1 1 1 1 1 1 1 1 1 1 1 1 1
symmnumber: 1
zpe: 1150677.2 jmol-1
zpe.correction: 0.438270 hartree
zpe.thermalcorrener: 0.463712 hartree
zpe.thermalcorrenthalpy: 0.464656 hartree
zpe.thermalcorrgfe: 0.380485 hartree
zpe.sumelectzpe: -1150.051453 hartree
zpe.sumelectthermal: -1150.026010 hartree
zpe.sumelectthermalent: -1150.025066 hartree
zpe.sumelectthermalfe: -1150.109238 hartree
dipole: -0.5201 6.7854 1.4948
dipole: 6.9676
quadrupole: -159.8862 -141.6746 -167.6636
quadrupole: 25.0446 8.8119 -5.1440
quadrupole: -3.4781 14.7335 -11.2555 25.0446 8.8119 -5.1440
hfenergy: -1150.4897227 hartree
pointgroup: C01 [X(C23H26N2O2)]
dipole: 0.0610702 2.7319339 -0.2173548 debye
polarizability: 452.681901|-20.4105952|302.2521467|-14.8547892|30.8850262|151.3389285 unknown
InChI: InChI=1S/C23H26N2O2/c1-3-25-20-11-9-17-6-4-5-7-18(17)22(20)19-10-8-16(12-21(19)25)13-24-23(2,14-26)15-27/h4-12,24,26-27H,3,13-15H2,1-2H3
charge 0 multiplicity 1
53 atoms
O  -7.683479 0.311085 -0.016407
O  -7.060355 -2.158825 0.875241
N  1.500657 2.090226 0.587619
N  -4.003915 -0.406731 -0.538611
C  0.475257 1.143442 0.421159
C  2.512922 0.07253 0.067225
C  1.068839 -0.132243 0.102958
C  2.733385 1.453199 0.363321
C  -5.455402 -0.696783 -0.417418
C  -1.761665 0.205568 0.333453
C  -3.273778 0.351675 0.495866
C  -0.920695 1.323028 0.528992
C  3.642914 -0.783551 -0.187421
C  1.313365 3.519981 0.865627
C  0.199297 -1.236834 -0.099835
C  -1.192284 -1.063172 0.015931
C  4.032977 2.033072 0.41427
C  4.96984 -0.192441 -0.13287
C  -6.252178 0.631436 -0.235764
C  -5.696301 -1.639581 0.805784
C  -5.896175 -1.404499 -1.716421
C  5.128283 1.20764 0.167813
C  3.538819 -2.180243 -0.489846
C  1.199877 4.377272 -0.415081
C  6.115381 -1.014662 -0.381828
C  4.67772 -2.958024 -0.728039
C  5.979809 -2.374694 -0.674917
H  -3.57156 -0.050349 1.484241
H  -3.516737 1.442713 0.51904
H  -1.355651 2.303295 0.757661
H  -3.721696 -0.158811 -1.493446
H  0.4050 3.634305 1.484325
H  2.160453 3.867554 1.484753
H  0.591479 -2.227577 -0.344942
H  -1.874586 -1.902762 -0.150315
H  4.173891 3.095713 0.636902
H  -6.13678 1.256602 -1.146017
H  -5.860629 1.186742 0.641929
H  -5.032442 -2.514529 0.706398
H  -5.439074 -1.107184 1.749782
H  -5.726942 -0.751013 -2.595058
H  -6.964896 -1.665614 -1.674354
H  -5.314579 -2.332983 -1.85114
H  6.142761 1.622266 0.198617
H  2.553878 -2.650909 -0.535613
H  2.112453 4.28889 -1.030028
H  1.058932 5.442064 -0.153701
H  0.342001 4.054023 -1.030389
H  7.110862 -0.556032 -0.337726
H  4.570415 -4.024279 -0.957046
H  6.864178 -2.993068 -0.862915
H  -8.203909 1.133692 0.153119
H  -7.666336 -1.377522 0.726122
