program: Gaussian 09
title: 000153916
version: EM64L-G09RevD.01
frameworkgroup: C1[X(C22H24N2O2)]
method: RPBEPBE
basis: SDD
operation: Freq
keyword: #p
keyword: freq=noraman
keyword: PBEPBE/SDD
title: #p freq=noraman PBEPBE/SDD
converged: YES YES NO NO
title: Mulliken charges:
elementType: O O N N C C C C C C C C C C C C C C C C C C C C C C H H H H H H H H H H H H H H H H H H H H H H H H
charge: -0.451415 -0.433926 -0.240475 -0.466486 0.282715 -0.020473 0.205832 0.417626 0.366139 -0.605219 0.192229 0.201041 -0.673171 0.207961 -0.363807 -0.418334 -0.738153 -0.420879 -0.410261 -0.347601 -0.648993 -0.381122 -0.262444 -0.284880 -0.280101 -0.231288 0.218235 0.255678 0.254195 0.294968 0.165308 0.222307 0.218173 0.219336 0.245136 0.248301 0.199591 0.225757 0.240519 0.217627 0.248573 0.240648 0.237956 0.232096 0.228043 0.226630 0.222747 0.223669 0.377545 0.342445
chargesum: 0.00000
title: Mulliken charges with hydrogens summed into heavy atoms:
elementType: O O N N C C C C C C C C C C C C C C C C C C C C C C
charge: -0.073870 -0.091480 -0.240475 -0.171519 0.282715 -0.020473 0.205832 0.417626 0.366139 -0.131306 0.192229 0.201041 -0.418976 0.207961 0.023808 0.019175 -0.045125 -0.195122 -0.169741 -0.129974 0.078183 -0.149025 -0.034400 -0.058250 -0.057354 -0.007619
polarizability: 3.96918585e+02 -3.07882155e+01 3.12415273e+02 2.49827184e+01 1.36862971e+01 1.41661868e+02
1716.lowfreq: -11.7946 -2.8016 -0.0004 0.0003 0.0004 7.9942 16.1235 20.8032 31.5281
frequency: 14.4565 20.5729 31.1203 38.5892 67.5169 82.4349 98.1268 112.6792 119.9651 125.7588 132.0266 148.3109 164.8882 213.2389 222.4108 224.9918 241.5323 267.8557 290.4639 304.2634 311.0672 331.5023 342.6170 346.8100 352.8337 371.7764 380.8961 423.8105 440.8578 455.3740 476.3520 518.0745 521.3211 530.1155 547.3751 574.8656 577.9006 589.8733 627.2921 637.7646 643.3297 665.9257 699.6741 703.2332 742.5651 746.5745 756.7215 761.1113 786.7114 788.6060 801.5215 803.8566 844.3308 870.5554 885.2949 894.3257 924.8969 928.3001 931.4436 944.3565 948.2628 955.5811 962.5706 970.6024 973.0002 983.1188 995.4060 1007.8635 1021.8057 1034.2120 1053.1748 1068.2195 1081.8520 1110.1482 1116.7536 1128.0024 1136.3753 1156.3435 1163.5050 1168.9815 1177.3430 1187.2360 1213.6074 1221.7760 1225.0403 1235.9089 1253.7381 1264.9233 1290.2445 1296.8129 1331.6674 1332.6114 1344.8304 1349.3933 1365.8718 1385.8515 1387.1346 1401.5461 1402.3695 1420.5168 1423.5881 1438.9794 1443.5267 1454.6220 1458.7385 1459.1743 1469.8455 1470.4831 1477.9442 1484.7937 1488.7532 1489.8984 1494.0087 1507.5385 1532.6912 1564.4946 1580.0247 1603.4193 1624.3852 1628.9301 2897.0575 2935.4739 2968.9080 2978.4175 2978.5272 3032.4513 3039.2260 3064.9459 3068.6350 3073.6787 3101.9402 3102.5245 3121.5982 3123.7135 3129.0713 3135.6122 3136.7266 3141.4265 3155.1637 3157.9256 3169.9586 3185.6803 3483.5732 3568.7715
redmass: 4.9289 5.3197 3.0818 1.2529 4.1306 4.6000 4.8352 3.7313 4.0666 3.0722 3.4191 4.0374 4.7936 4.4914 3.8886 2.9644 1.2141 2.5479 1.7371 2.1928 2.5468 4.1683 2.1176 4.8692 2.6499 3.7085 4.6924 3.0676 2.8503 3.6225 3.0759 3.8061 5.3552 4.2596 4.7869 2.8226 2.7313 4.6804 3.6323 4.6399 2.4210 3.6094 4.6754 4.5163 4.1482 1.3974 2.4757 1.9793 1.4639 1.8645 3.9544 2.4473 1.5712 1.9620 1.5252 1.8628 1.8798 1.4236 5.7714 1.5852 1.4228 2.2605 3.0241 1.3196 3.7130 1.3391 2.0300 4.5159 2.1713 3.0202 2.8373 3.6227 3.1997 1.4230 1.3127 1.8274 1.5260 1.5803 1.6803 1.1282 1.1204 1.5791 1.6085 1.7112 1.7685 2.6786 1.6793 1.6581 1.3081 1.8089 2.2534 1.2520 2.4117 1.5363 1.2271 1.2584 2.3204 5.1977 4.1151 1.2262 2.7337 2.0265 1.1952 2.8430 2.3369 1.0994 2.0398 1.0616 1.2773 1.0747 2.2885 1.3075 1.0829 1.1178 4.4546 7.3229 6.4631 7.0804 6.5788 7.3996 1.0702 1.0695 1.0632 1.0384 1.0388 1.0908 1.0906 1.0996 1.0961 1.0969 1.1003 1.1005 1.0644 1.0846 1.0849 1.0917 1.0900 1.0897 1.0956 1.0968 1.0992 1.0932 1.0760 1.0664
irintensity: 0.6833 1.4898 0.4006 0.1413 1.0435 0.9393 2.1017 5.9722 5.4944 0.8004 2.6380 5.1669 0.6837 0.5136 0.3925 1.4790 2.0290 1.1520 90.5539 12.6723 18.7064 5.1772 26.3115 2.7858 12.1547 9.5055 2.9674 2.9287 0.3773 3.9432 14.3200 7.9789 0.3403 0.1259 8.4079 11.4024 14.1460 6.6531 22.0395 6.9186 21.8626 3.1755 9.6629 13.3947 0.1410 28.0941 36.1690 66.7204 131.5181 13.5749 5.0484 1.5795 0.0031 0.3099 6.7118 16.8805 15.0889 2.2184 19.0807 11.9610 0.8086 5.3134 11.9121 0.6113 110.7620 0.1166 2.1174 59.4114 15.1804 11.1680 5.8977 18.5536 14.5854 19.4286 6.3140 6.3000 8.1313 56.0950 13.6375 2.8517 4.1452 56.6253 28.0159 2.6618 3.6520 10.8643 24.1607 3.6603 25.1676 18.6437 64.0676 15.5154 9.2824 15.9857 0.7011 31.0292 33.0705 9.1596 32.6123 37.7893 17.3705 0.6438 48.1434 16.6024 9.0017 5.8804 16.4898 9.7775 41.8645 13.3810 10.2178 32.6361 1.5622 11.3602 18.2091 15.2093 1.0916 23.9294 18.8366 21.3827 97.1238 48.0337 75.6215 10.7846 79.7234 74.0496 9.8167 20.0982 20.5049 29.4904 10.2978 8.7226 183.0010 1.6258 0.0866 7.3910 18.8678 18.4395 69.8113 1.1690 18.8253 25.9633 2.2736 11.4676
temp: 298.150 k
press: 1.00000 atm
elementType: 8 8 7 7 6 6 6 6 6 6 6 6 6 6 6 6 6 6 6 6 6 6 6 6 6 6 1 1 1 1 1 1 1 1 1 1 1 1 1 1 1 1 1 1 1 1 1 1 1 1
symmnumber: 1
zpe: 1078876.5 jmol-1
zpe.correction: 0.410922 hartree
zpe.thermalcorrener: 0.434823 hartree
zpe.thermalcorrenthalpy: 0.435768 hartree
zpe.thermalcorrgfe: 0.355932 hartree
zpe.sumelectzpe: -1110.825725 hartree
zpe.sumelectthermal: -1110.801824 hartree
zpe.sumelectthermalent: -1110.800879 hartree
zpe.sumelectthermalfe: -1110.880716 hartree
dipole: 0.9832 -0.1725 -1.4846
dipole: 1.7890
quadrupole: -155.9329 -141.2338 -158.9221
quadrupole: -6.4764 6.8196 9.5043
quadrupole: -3.9033 10.7958 -6.8925 -6.4764 6.8196 9.5043
hfenergy: -1111.236647 hartree
pointgroup: C01 [X(C22H24N2O2)]
dipole: -0.3940492 -0.0260626 0.5825987 debye
polarizability: 397.1282415|31.5179898|309.2269735|25.668163|-24.2586653|144.6405104 unknown
InChI: InChI=1S/C22H24N2O2/c1-22(13-25,14-26)23-12-15-11-20-21(17-8-4-3-7-16(15)17)18-9-5-6-10-19(18)24(20)2/h3-11,23,25-26H,12-14H2,1-2H3
charge 0 multiplicity 1
50 atoms
O  3.308069 -2.709298 -0.584143
O  6.813265 -0.334468 0.714499
N  -2.235125 -1.919548 0.41127
N  3.130734 -0.117494 -0.37061
C  4.550748 -0.583702 -0.361857
C  -1.914902 0.347993 0.069483
C  -1.286156 -0.885834 0.416306
C  0.89564 0.161301 0.647311
C  -1.113356 1.541204 -0.003917
C  2.388928 0.032303 0.915717
C  0.310255 1.441842 0.287418
C  -3.327114 0.047321 -0.143524
C  0.099954 -0.985102 0.708828
C  -3.486581 -1.370439 0.085197
C  4.492906 -2.110924 0.015677
C  5.439435 0.194925 0.647286
C  5.104564 -0.419218 -1.793609
C  -1.65094 2.822001 -0.354974
C  1.108918 2.630774 0.202553
C  -4.476071 0.802414 -0.498348
C  -1.971204 -3.323118 0.725798
C  -4.735054 -2.019689 -0.024594
C  -0.841345 3.95968 -0.426818
C  0.553381 3.865383 -0.145978
C  -5.724526 0.1587 -0.614627
C  -5.853787 -1.23853 -0.379493
H  2.74906 0.88588 1.529145
H  2.57149 -0.88196 1.508007
H  0.554461 -1.945864 0.974362
H  2.952011 0.648981 -1.029674
H  4.468713 -2.232807 1.124625
H  5.383648 -2.634882 -0.375442
H  5.56568 1.239807 0.314137
H  4.9773 0.193948 1.656412
H  4.599258 -1.114884 -2.486605
H  6.187387 -0.629481 -1.798911
H  4.957729 0.615252 -2.16064
H  -2.71674 2.913183 -0.574749
H  2.180105 2.578339 0.426348
H  -4.414394 1.878065 -0.683652
H  -0.966566 -3.608263 0.371478
H  -2.034706 -3.521672 1.812892
H  -2.703327 -3.963389 0.207156
H  -4.844487 -3.092626 0.164566
H  -1.278944 4.926437 -0.699142
H  1.184713 4.758877 -0.201051
H  -6.610337 0.742167 -0.887941
H  -6.836449 -1.714142 -0.472241
H  2.736746 -1.892991 -0.789946
H  6.804614 -1.20395 1.188213
