program: Gaussian 09
title: 000153898
version: EM64L-G09RevD.01
frameworkgroup: C1[X(C22H24N2O2)]
method: RPBEPBE
basis: SDD
operation: Freq
keyword: #p
keyword: freq=noraman
keyword: PBEPBE/SDD
title: #p freq=noraman PBEPBE/SDD
converged: YES YES NO NO
title: Mulliken charges:
elementType: O O N N C C C C C C C C C C C C C C C C C C C C C C H H H H H H H H H H H H H H H H H H H H H H H H
charge: -0.501602 -0.454026 -0.225115 -0.372671 0.250290 0.200554 0.032767 0.178624 0.230445 0.479060 -0.562634 -0.606316 0.283563 -0.353136 -0.330668 -0.368060 -0.720469 -0.375627 0.402471 -0.402035 -0.652070 -0.483575 -0.382348 -0.458267 -0.270190 -0.253816 0.225314 0.197910 0.259789 0.223376 0.199938 0.222940 0.223386 0.168288 0.235765 0.189054 0.251093 0.232286 0.264281 0.228901 0.237360 0.239754 0.241312 0.237350 0.220876 0.238592 0.223341 0.226155 0.361245 0.366549
chargesum: 0.00000
title: Mulliken charges with hydrogens summed into heavy atoms:
elementType: O O N N C C C C C C C C C C C C C C C C C C C C C C
charge: -0.140357 -0.087478 -0.225115 -0.112882 0.250290 0.200554 0.032767 0.178624 0.230445 0.479060 -0.139410 -0.382940 0.283563 0.069742 0.061005 -0.132296 -0.048036 -0.111346 0.402471 -0.173135 0.066355 -0.246225 -0.161473 -0.219675 -0.046850 -0.027661
polarizability: 4.07613913e+02 -3.03510755e+01 3.19968649e+02 -7.63148846e+00 -4.27771030e+00 1.34788795e+02
1716.lowfreq: -20.8575 -10.9683 -6.7239 0.0001 0.0001 0.0009 1.6286 9.3494 9.4516
frequency: -20.3117 -1.8263 7.5822 35.9553 65.2766 77.6266 83.9599 100.3313 105.3578 137.4718 147.2660 165.2700 170.3033 196.6194 202.1041 241.9294 242.5436 252.1521 265.9143 273.2543 289.1480 321.9050 334.8145 355.3066 365.8525 384.7983 388.5486 417.6099 423.1355 444.9891 452.3361 480.7945 518.7584 522.0997 541.3211 557.3491 565.9650 589.3967 600.9435 618.2570 628.6851 640.1062 674.2667 692.6972 706.5380 738.1969 751.0273 759.8621 778.4458 804.1335 809.7271 810.1481 816.2678 864.4830 870.8649 891.3582 898.5370 927.7001 938.4572 943.3013 944.3714 949.7136 952.5026 962.0948 963.4821 981.6319 984.5245 996.8589 1011.3064 1030.1460 1076.6694 1094.7554 1117.8046 1120.6859 1136.6767 1137.3097 1151.6626 1153.1170 1156.1781 1158.2480 1172.1723 1174.4847 1198.6246 1216.0650 1224.6831 1239.8480 1257.1277 1261.5578 1286.3837 1294.9796 1317.1373 1326.9171 1342.8537 1357.6095 1379.2393 1380.9834 1396.7878 1398.6740 1405.6692 1410.8093 1422.9362 1438.9079 1443.3735 1454.1681 1459.4195 1460.8894 1463.7155 1472.3221 1473.1790 1476.9087 1480.0475 1484.6114 1487.6779 1494.3255 1537.5937 1567.4770 1580.5617 1597.1054 1629.1486 1629.8334 2868.0669 2921.3701 2947.3976 2976.1195 2979.6944 2997.5700 3010.0052 3056.0880 3069.9058 3076.1211 3111.0642 3118.2325 3120.1068 3126.6007 3131.5670 3135.2431 3142.6849 3152.1490 3155.9765 3158.4296 3179.1841 3400.8593 3474.5104 3583.6555
redmass: 1.0509 3.8023 4.9912 4.8588 3.6661 3.7612 3.8470 4.1115 3.4468 3.9873 3.5368 3.7403 2.8160 3.3606 1.3640 3.4129 3.1815 2.2338 1.6513 2.3829 3.4918 4.0074 3.3423 3.1778 4.7948 4.8348 5.3008 2.9213 2.4610 3.0362 2.6032 4.9551 5.9067 3.0419 2.2542 3.5842 2.7445 4.0174 2.9452 1.6035 3.5730 3.3569 4.8721 3.6817 4.9976 3.1181 1.3443 3.6709 4.0642 2.6061 2.1557 2.6891 1.4992 3.8639 1.8360 1.6326 1.8999 1.4986 4.5797 1.3935 1.6878 2.4146 1.7861 1.4165 2.5803 2.4351 1.3535 3.0272 2.5623 2.4532 3.3355 2.8237 1.3429 1.6837 1.4797 1.4719 1.4078 1.4307 1.5083 1.6947 1.8676 1.1887 1.3975 1.3408 2.0651 2.3797 1.6140 1.8143 1.5657 1.8558 2.1647 1.3139 1.7094 2.4320 1.5475 1.8659 5.7806 1.3056 3.3069 1.2026 3.5580 2.2859 2.1720 1.1497 2.2394 1.0876 1.0959 1.8372 1.3190 1.1011 1.1254 1.7082 1.4035 1.3817 4.5849 6.6364 6.6928 6.8299 7.0222 7.2115 1.0714 1.0697 1.0546 1.0382 1.0406 1.0862 1.1080 1.0993 1.0935 1.0954 1.0975 1.0866 1.0981 1.0868 1.0894 1.0875 1.0910 1.0969 1.0968 1.0961 1.0938 1.0655 1.0754 1.0670
irintensity: 0.1425 2.7839 1.6303 1.2406 0.3136 2.0323 3.4919 0.2989 3.9916 0.3595 1.0667 1.5275 5.0909 0.6838 1.6632 3.5431 3.1343 61.6966 41.0591 29.5834 4.8156 0.5253 2.0853 2.0460 5.6286 1.9412 1.2127 7.6433 1.2939 1.5281 20.8942 3.4827 5.5291 13.0164 60.1265 6.1281 15.7370 11.1501 18.8834 119.4858 29.2249 20.8955 0.9307 3.4653 2.2841 19.5942 36.5653 6.7962 10.1667 0.5214 17.5271 20.1283 85.4887 4.4134 14.0707 5.5266 4.2968 0.7284 19.8998 5.1397 11.3743 37.7911 23.1254 4.2772 16.0130 0.8841 0.2958 154.3534 26.0222 9.4820 17.7145 10.1732 6.5159 1.4917 7.5583 74.8377 29.7462 13.5855 27.3800 0.9574 5.5215 1.7274 28.2304 8.9060 0.3822 18.9940 11.1321 3.5952 12.2747 34.3492 27.7349 32.7442 25.6682 43.3267 23.3894 5.8163 3.6670 12.5844 32.9524 76.7478 11.5382 6.4248 14.7303 24.6750 4.6053 2.5481 2.2798 3.3389 27.2109 9.5017 16.3746 77.8868 8.6222 15.7975 30.9879 3.2435 8.6117 20.9195 2.8064 32.9862 55.4720 98.0930 66.7346 85.3901 25.3630 16.4968 66.5098 24.7486 21.5240 37.3057 9.9100 4.3447 15.2835 2.0088 16.1548 7.8380 11.7014 29.5328 39.2986 13.9283 20.2985 109.8248 0.8128 1.9748
temp: 298.150 k
press: 1.00000 atm
elementType: 8 8 7 7 6 6 6 6 6 6 6 6 6 6 6 6 6 6 6 6 6 6 6 6 6 6 1 1 1 1 1 1 1 1 1 1 1 1 1 1 1 1 1 1 1 1 1 1 1 1
symmnumber: 1
zpe: 1076389.1 jmol-1
zpe.correction: 0.409975 hartree
zpe.thermalcorrener: 0.432455 hartree
zpe.thermalcorrenthalpy: 0.433399 hartree
zpe.thermalcorrgfe: 0.357768 hartree
zpe.sumelectzpe: -1110.825871 hartree
zpe.sumelectthermal: -1110.803391 hartree
zpe.sumelectthermalent: -1110.802447 hartree
zpe.sumelectthermalfe: -1110.878078 hartree
dipole: -2.8832 1.1666 1.5440
dipole: 3.4724
quadrupole: -168.9114 -122.6720 -161.3549
quadrupole: 31.2896 7.7537 -2.3368
quadrupole: -17.9320 28.3075 -10.3755 31.2896 7.7537 -2.3368
hfenergy: -1111.235846 hartree
pointgroup: C01 [X(C22H24N2O2)]
dipole: 1.1326976 -0.5501633 0.5297693 debye
polarizability: 406.8762525|-31.9587103|316.3061539|1.3001526|28.9394125|139.1889501 unknown
InChI: InChI=1S/C22H24N2O2/c1-22(13-25,14-26)23-12-15-7-9-19-18(11-15)21-17-6-4-3-5-16(17)8-10-20(21)24(19)2/h3-11,23,25-26H,12-14H2,1-2H3
charge 0 multiplicity 1
50 atoms
O  -6.749731 -2.020889 -0.160364
O  -7.144126 0.519399 -0.980257
N  2.316327 2.420056 0.301559
N  -3.699955 0.104258 0.559329
C  -5.138405 -0.215368 0.37083
C  1.080149 0.499147 -0.07626
C  2.494564 0.140125 -0.06219
C  1.01258 1.91976 0.158746
C  3.219376 1.350122 0.177667
C  -1.371697 0.475493 -0.206097
C  -2.680788 -0.275302 -0.442286
C  -0.13817 -0.208374 -0.255982
C  3.21829 -1.094005 -0.231925
C  -5.321949 -1.745187 0.132923
C  -5.690206 0.588314 -0.851084
C  -0.214065 2.616061 0.22548
C  -5.880128 0.213415 1.65473
C  -1.399354 1.880736 0.040757
C  4.668692 -1.049642 -0.147659
C  4.64007 1.391397 0.264035
C  2.644739 3.819345 0.565545
C  5.342138 0.199218 0.100485
C  2.597395 -2.361606 -0.478684
C  5.419724 -2.257417 -0.312083
C  3.358744 -3.525599 -0.635417
C  4.783124 -3.478506 -0.552293
H  -3.0779 -0.014873 -1.442868
H  -2.455449 -1.369225 -0.471561
H  -3.380692 -0.035879 1.524702
H  -0.141952 -1.288188 -0.435808
H  -5.005307 -2.299824 1.041084
H  -4.700695 -2.068603 -0.728076
H  -5.438858 1.652615 -0.708483
H  -5.204002 0.232534 -1.787633
H  -0.250735 3.69327 0.418882
H  -5.49259 -0.338752 2.533595
H  -6.959477 0.016146 1.564811
H  -5.735595 1.294301 1.82599
H  -2.375239 2.373627 0.1007
H  5.173385 2.327403 0.458178
H  3.716167 3.992996 0.382213
H  2.073301 4.480028 -0.110736
H  2.416827 4.101828 1.611296
H  6.436727 0.197668 0.161881
H  1.508895 -2.425218 -0.547376
H  6.51361 -2.208805 -0.246384
H  2.858283 -4.482121 -0.824114
H  5.369379 -4.395342 -0.676809
H  -6.88555 -2.978332 -0.363225
H  -7.389471 -0.444305 -0.87547
