program: Gaussian 09
title: 000153895
version: EM64L-G09RevD.01
frameworkgroup: C1[X(C12H2Br8)]
method: RPBEPBE
basis: SDD
operation: Freq
keyword: #pfreq=noraman
keyword: PBEPBE/SDD
title: #p freq=noraman PBEPBE/SDD
converged: YES YES NO NO
title: Mulliken charges:
elementType: Br Br Br Br Br Br Br Br C C C C C C C C C C C C H H
charge: 0.129389 0.086928 0.125324 0.125325 0.129265 0.091662 0.091674 0.097882 0.408293 0.417575 -0.294405 -0.343193 -0.316606 -0.316645 -0.158181 -0.149158 -0.169135 -0.169173 -0.193275 -0.164635 0.284854 0.286235
chargesum: 0.00000
title: Mulliken charges with hydrogens summed into heavy atoms:
elementType: Br Br Br Br Br Br Br Br C C C C C C C C C C C C
charge: 0.129389 0.086928 0.125324 0.125325 0.129265 0.091662 0.091674 0.097882 0.408293 0.417575 -0.294405 -0.343193 -0.316606 -0.316645 -0.158181 0.135695 -0.169135 -0.169173 -0.193275 0.121600
polarizability: 3.50757655e+02 -1.42036927e-02 2.48374807e+02 -1.12292066e+00 3.34018084e-03 2.18493288e+02
1716.lowfreq: -1.9992 -1.7286 -0.6029 0.0000 0.0001 0.0003 19.5659 21.3547 24.4663
frequency: 19.5632 21.3542 24.4655 39.0551 43.7154 59.7675 59.8688 83.4168 120.3327 122.5639 132.5765 134.0338 136.0472 138.8828 140.8676 171.1149 199.8710 204.3190 212.5489 222.7379 261.7664 285.7285 316.5093 343.8555 368.8408 439.0338 460.9932 473.1448 504.6253 507.8972 532.0751 582.6504 598.2153 630.1325 690.4626 726.1759 735.7158 740.4369 759.3532 821.3627 873.1838 878.7717 977.9728 1037.3887 1103.0736 1146.9007 1162.4526 1208.2100 1278.1455 1319.8877 1320.3989 1334.5833 1360.9271 1414.0549 1507.8550 1520.6748 1533.7143 1552.1341 3184.3658 3188.6289
redmass: 62.9286 57.9420 48.5992 74.9614 76.0190 52.3043 59.6502 66.5210 55.1474 60.7485 33.6383 11.5498 23.5820 9.7555 63.5062 44.4069 63.4136 65.2730 70.9671 74.3479 7.3914 7.0310 12.2039 11.9833 12.3624 9.4799 6.6840 7.7111 9.3868 7.7029 6.4832 12.0275 5.7641 9.6112 10.8922 10.2824 8.7950 8.6288 11.5121 10.0165 1.4053 1.4193 10.5436 9.9701 10.5902 2.3972 1.7080 3.9379 10.6303 11.7203 10.7580 3.6058 2.7078 5.3870 10.0267 7.5878 10.6463 10.2379 1.0929 1.0932
irintensity: 0.0012 0.0094 0.0252 0.0000 0.0007 0.0405 0.0961 0.0038 0.0410 0.0483 0.3096 0.0699 0.0634 0.0585 0.0972 0.0208 0.0025 0.0324 0.0057 0.0171 1.7062 1.1132 0.0094 0.6268 14.4028 19.2670 0.3006 11.8923 17.6629 6.3406 23.5378 0.0022 2.0222 10.2903 10.0279 32.0690 0.0015 2.1180 0.7499 48.3460 12.2591 14.2141 95.5430 27.9550 5.6227 30.9851 59.9727 40.4947 132.3733 2.9693 1.9977 99.0719 136.3016 48.6927 31.4942 10.6398 0.2688 51.3100 1.0219 1.1827
temp: 298.150 k
press: 1.00000 atm
elementType: 35 35 35 35 35 35 35 35 6 6 6 6 6 6 6 6 6 6 6 6 1 1
symmnumber: 1
zpe: 251032.8 jmol-1
zpe.correction: 0.095613 hartree
zpe.thermalcorrener: 0.117580 hartree
zpe.thermalcorrenthalpy: 0.118524 hartree
zpe.thermalcorrgfe: 0.036677 hartree
zpe.sumelectzpe: -564.729963 hartree
zpe.sumelectthermal: -564.707996 hartree
zpe.sumelectthermalent: -564.707052 hartree
zpe.sumelectthermalfe: -564.788899 hartree
dipole: 0.4052 0.0003 0.5450
dipole: 0.6791
quadrupole: -179.1715 -188.5145 -184.7196
quadrupole: -0.0003 -3.4472 0.0013
quadrupole: 4.9637 -4.3793 -0.5844 -0.0003 -3.4472 0.0013
hfenergy: -564.8255759 hartree
pointgroup: C01 [X(C12H2Br8)]
dipole: 0.1460667 -0.0013796 -0.2237197 debye
dipolederiv: -0.1268586 -0.0018272 -0.2606119 -0.0015817 0.0491886 -0.0035096 -0.2245117 -0.0034773 -0.4591023 -0.2371158 0.0015352 0.2815374 0.001543 0.0256487 -0.0029745 0.2847022 -0.0029909 -0.4907608 -0.1475385 -0.2996888 -0.013665 -0.2391305 -0.4407736 -0.0164518 -0.0130853 -0.0191841 0.0487119 -0.1482436 0.2998569 -0.0174766 0.2393434 -0.4395376 0.0226025 -0.0161269 0.0253209 0.0482033 -0.2079328 0.0017386 0.3079758 0.0020837 0.0482148 -0.0021265 0.3694773 -0.0020996 -0.3340649 -0.2571376 -0.3394208 -0.0141556 -0.3457143 -0.4355124 -0.0184979 -0.0188743 -0.0227497 0.0214902 -0.2580332 0.3394212 -0.0184538 0.3456921 -0.4339767 0.0242102 -0.0232216 0.0284174 0.0209151 -0.7068319 -0.0014036 -0.1175013 -0.0017162 0.0268969 -0.0003587 -0.1634797 -0.0003911 -0.0110934 0.1005594 0.0005162 0.0939154 -0.0002947 0.0878827 -0.0035105 -0.0172281 -0.0036308 -0.4794482 0.1968014 0.0003406 -0.0056372 0.0004039 -0.3172231 0.0026594 0.0003011 0.0026718 0.1057485 0.1288793 0.0029803 0.4328733 0.0033106 -0.0847292 0.0053099 0.4815546 0.0053412 0.6729768 0.375789 -0.0027016 -0.509634 -0.0015468 -0.1183678 0.0059199 -0.3366815 0.0061174 0.9049499 0.031437 0.515939 0.0167568 0.6246587 0.5717313 0.0470854 0.0070702 0.0308046 -0.0896595 0.0330272 -0.5164249 0.0233422 -0.6252762 0.5691402 -0.0554108 0.0149755 -0.0391279 -0.0885735 -0.0389972 -0.0046655 -0.7367327 -0.004822 -0.0552765 0.0020092 -0.7677689 0.0020346 0.3771365 -0.5352306 0.000206 0.1078214 0.0004137 -0.0194735 -0.0014644 0.1377755 -0.0014326 -0.270644 0.3881879 0.5715848 0.0241226 0.8170536 0.6251176 0.0488801 0.0313748 0.0370249 -0.0837468 0.3900661 -0.5715259 0.0313848 -0.8168982 0.6220178 -0.0577003 0.0416536 -0.0457934 -0.0825512 1.1688893 0.0037299 0.4069769 0.002791 -0.0931611 0.0012246 0.2588356 0.001064 0.0366715 -0.2317238 0.0000668 -0.0095339 0.0000115 -0.4044168 0.0023758 -0.016762 0.0023731 -0.0234042 0.0620332 -0.0001617 -0.0133768 -0.0002229 0.1460036 -0.0007578 -0.019811 -0.0007767 0.0277363 0.0199739 -0.0000955 -0.009928 -0.0001017 0.0706063 0.0004861 -0.0101695 0.0004841 0.1485087 unknown
polarizability: 350.4034756|0.0578506|248.373746|-6.926386|-0.1849277|218.8485285 unknown
InChI: InChI=1S/C12H2Br8/c13-3-1-6(16)11(19)12(20)7(3)8-9(17)4(14)2-5(15)10(8)18/h1-2H
charge 0 multiplicity 1
22 atoms
Br -0.655329 0.01733 2.711709
Br -0.179227 -0.019134 -3.074063
Br 0.572845 -2.894793 -0.04688
Br 0.568897 2.895454 -0.083403
Br -4.052867 0.012124 2.410269
Br 4.017467 2.86282 0.180445
Br 4.02134 -2.854168 0.216424
Br -5.409874 -0.009297 -0.751966
C  -0.65083 -0.001339 -0.181587
C  0.84125 0.000619 -0.045973
C  -1.500554 0.005275 0.95969
C  -1.269092 -0.010023 -1.457048
C  1.562482 -1.224572 0.017008
C  1.56074 1.227514 0.001516
C  -2.916328 0.003224 0.839829
C  -2.666366 -0.012294 -1.607899
C  2.971053 1.223785 0.111019
C  2.972768 -1.217541 0.126462
C  -3.484906 -0.005672 -0.460218
C  3.674335 0.003959 0.172946
H  -3.116928 -0.019117 -2.602188
H  4.763423 0.005245 0.25651
