program: Gaussian 09
title: 000153866
version: EM64L-G09RevD.01
frameworkgroup: C1[X(C12H3Br4ClO2)]
method: RPBEPBE
basis: SDD
operation: Freq
keyword: #p
keyword: freq=noraman
keyword: PBEPBE/SDD
title: #p freq=noraman PBEPBE/SDD
converged: NO YES NO NO
title: Mulliken charges:
elementType: Br Br Br Br Cl O O C C C C C C C C C C C C H H H
charge: 0.135589 0.125753 0.117137 0.064467 0.055451 -0.256523 -0.249541 0.493932 0.445803 0.419429 0.268264 -0.447765 -0.321555 -0.199768 -0.212196 -0.412828 -0.369699 -0.211035 -0.218630 0.271770 0.255893 0.246054
chargesum: 0.00000
title: Mulliken charges with hydrogens summed into heavy atoms:
elementType: Br Br Br Br Cl O O C C C C C C C C C C C C
charge: 0.135589 0.125753 0.117137 0.064467 0.055451 -0.256523 -0.249541 0.493932 0.445803 0.419429 0.268264 -0.447765 -0.321555 -0.199768 -0.212196 -0.412828 -0.097928 0.044857 0.027424
polarizability: 3.27109640e+02 -5.31192341e+00 2.71603238e+02 1.80349723e-04 1.27222251e-02 7.39331657e+01
1716.lowfreq: -4.1029 -2.5385 -0.0015 -0.0013 -0.0012 3.4692 23.2913 32.4463 47.4611
frequency: 23.2878 32.4328 47.4610 62.6527 67.4021 125.1811 134.0239 141.6153 145.1625 159.9278 179.6581 214.1878 217.0708 236.5063 265.7603 275.3093 298.0937 318.8402 343.8761 348.4103 489.1868 503.9321 517.3558 520.3600 545.3399 580.3820 582.7386 592.1510 599.0583 688.3798 702.4580 723.8664 728.6421 772.5074 797.5161 855.4492 888.8318 904.4280 912.2965 964.0830 1056.4585 1105.3436 1113.5652 1162.8042 1195.7110 1214.7107 1252.1790 1325.6891 1332.0195 1369.8954 1397.6432 1436.4788 1443.0935 1535.2010 1546.5978 1592.1578 1611.5696 3157.7261 3175.8142 3187.1645
redmass: 24.9863 10.2951 24.6105 24.2343 44.4612 32.8507 40.5839 62.0493 8.8217 13.0072 33.7481 52.2447 6.0321 13.4159 25.9523 6.3851 10.5816 12.0974 12.3909 9.6458 11.4676 12.2109 4.2677 5.1447 8.2520 12.0640 11.7276 12.0732 11.6272 4.5412 10.3871 10.3972 9.4416 1.3491 8.6581 9.8071 1.3623 11.2524 12.1429 1.3121 2.1434 5.2841 10.6316 1.3600 3.8832 2.0313 3.3388 10.5008 11.0719 9.8720 10.8718 2.5399 3.8823 11.1714 10.0406 8.1699 9.1018 1.0874 1.0928 1.0995
irintensity: 0.1895 0.8553 0.4248 0.1524 0.1823 0.1216 0.3557 0.1412 0.3640 0.0051 0.0461 0.0475 0.3128 1.3541 0.1548 1.4230 2.2816 0.1571 3.1128 0.0441 1.5878 4.9368 0.4241 0.4605 5.7677 5.8060 0.4805 2.4211 14.0686 14.2509 8.9523 3.0643 30.8857 68.5740 51.8666 54.6310 1.4199 65.2372 93.2726 1.0214 19.8821 8.4574 11.7683 4.0160 36.0931 0.0670 120.6675 171.7164 120.0654 212.9609 451.9726 59.2007 300.0769 23.1110 2.8849 48.7623 3.4391 4.9835 1.5567 3.7884
temp: 298.150 k
press: 1.00000 atm
elementType: 35 35 35 35 17 8 8 6 6 6 6 6 6 6 6 6 6 6 6 1 1 1
symmnumber: 1
zpe: 297377.6 jmol-1
zpe.correction: 0.113265 hartree
zpe.thermalcorrener: 0.131051 hartree
zpe.thermalcorrenthalpy: 0.131995 hartree
zpe.thermalcorrgfe: 0.063065 hartree
zpe.sumelectzpe: -1122.061104 hartree
zpe.sumelectthermal: -1122.043318 hartree
zpe.sumelectthermalent: -1122.042374 hartree
zpe.sumelectthermalfe: -1122.111304 hartree
dipole: -2.2824 1.7957 -0.0004
dipole: 2.9042
quadrupole: -137.3783 -143.3305 -154.8523
quadrupole: -12.5404 -0.0001 0.0004
quadrupole: 7.8087 1.8565 -9.6653 -12.5404 -0.0001 0.0004
hfenergy: -1122.1743691 hartree
pointgroup: C01 [X(C12H3Br4Cl1O2)]
dipole: 1.0157699 0.5231887 0.0001464 debye
dipolederiv: 0.0738253 0.1272244 -0.0000062 0.0811702 -0.4843697 0.0000221 -0.0000208 0.0001013 0.060431 -0.3781583 -0.293982 0.0000462 -0.3424 -0.1348728 0.0000368 0.0000929 0.0000532 0.0506935 -0.4779313 0.2705888 0.0000636 0.2833738 -0.0484563 -0.0000346 0.0001399 -0.0000788 0.0488023 -0.0189501 0.0725543 -0.0000107 0.1724971 -0.5170161 0.0000766 -0.0000278 0.0000792 0.0142836 -0.0102162 0.0055012 -0.0000039 0.0657485 -0.6572163 -0.0000033 0.0000157 -0.0000407 0.0102886 -2.1525856 -0.0813265 -0.0000596 -0.1532313 -0.2185407 -0.0000447 -0.0001874 -0.0000334 -0.1180362 -2.1337935 -0.1477271 -0.0000382 -0.2359228 -0.3898712 0.0000509 -0.000031 0.0000881 -0.1263765 1.413124 0.0305304 0.0000458 -0.8120807 -0.1833264 0.0000184 0.000214 0.0000558 0.1301805 1.1351089 0.1876598 -0.0000791 1.09228 0.0443713 0.0000012 -0.0002034 -0.0000773 0.1139239 1.0914875 0.1580035 0.0000828 1.1953426 -0.1690533 0.000127 0.0000397 0.0000694 0.1188164 1.3803748 0.0136503 0.0000945 -0.8018613 0.1589784 -0.000059 0.0001885 -0.0000169 0.0738551 -0.3613127 -0.2243915 -0.0000106 -0.3122 0.8442964 -0.0000507 0.0000125 -0.0001647 -0.1404786 -0.3136396 -0.0218287 0.0000265 0.0319804 0.9430101 -0.0000072 0.0000589 0.000046 -0.0627442 0.4362672 0.5943556 -0.0000602 0.7241105 0.0555376 -0.0000819 -0.0000879 -0.0000736 -0.0502805 0.6600678 -0.530198 -0.000131 -0.58774 -0.10465 0.0000892 -0.0002355 0.0001357 -0.0825652 -0.1007114 -0.1306293 0.0000363 -0.387118 1.0204676 -0.0001629 0.000043 -0.0001679 -0.1468959 -0.3179841 0.0001793 0.0000118 -0.0502851 0.004092 -0.0000321 0.0000004 -0.0000143 -0.1563364 -0.0550231 0.0032058 0.0000184 0.0158599 -0.3199248 0.0000156 0.0000209 0.0000258 -0.0985355 0.0788091 -0.0510789 0.0000413 0.0091191 0.071985 -0.0000159 0.0000395 -0.0000363 -0.1497363 0.1059537 0.0469533 -0.0000175 0.0260189 -0.0022297 0.0000248 -0.0000094 0.0000182 0.1797696 -0.0184755 0.0486814 -0.0000327 0.0618049 0.0757526 0.0000218 -0.0000381 0.0000227 0.1643031 -0.0362371 -0.077926 -0.0000173 -0.0764664 0.0110363 0.0000081 -0.0000247 0.0000084 0.1666377 unknown
polarizability: 327.0894714|-5.4162344|271.6234067|-0.002238|-0.0125251|73.9331657 unknown
InChI: InChI=1S/C12H3Br4ClO2/c13-4-2-1-3-5-10(4)19-11-8(16)6(14)7(15)9(17)12(11)18-5/h1-3H
charge 0 multiplicity 1
22 atoms
Br -1.295055 -3.334531 0.000074
Br -4.462185 -2.013098 0.000284
Br -4.815059 1.380713 0.000319
Br 3.426115 -2.810545 0.000517
Cl -2.027818 3.181934 -0.000061
O  0.801359 -1.193268 -0.000183
O  0.485083 1.691312 -0.000467
C  -0.471677 -0.586158 -0.000292
C  -0.623079 0.82011 -0.000301
C  1.920403 -0.32244 -0.000046
C  1.771672 1.085116 -0.000219
C  -1.604553 -1.424513 -0.000179
C  -1.910074 1.387696 -0.000182
C  -2.907256 -0.854604 -0.000049
C  -3.060451 0.557623 -0.000067
C  3.213777 -0.876893 0.000238
C  2.886163 1.934404 -0.000147
C  4.349873 -0.036753 0.000322
C  4.179993 1.364869 0.000115
H  2.728109 3.016027 -0.000288
H  5.349145 -0.479584 0.000543
H  5.059615 2.015084 0.000171
