program: Gaussian 09
title: 000153841
version: EM64L-G09RevD.01
frameworkgroup: C1[X(C14H11N3O2)]
method: RPBEPBE
basis: SDD
operation: Freq
keyword: #p
keyword: freq=noraman
keyword: PBEPBE/SDD
title: #p freq=noraman PBEPBE/SDD
converged: YES YES YES YES
title: Mulliken charges:
elementType: O O N N N C C C C C C C C C C C C C C H H H H H H H H H H H
charge: -0.217041 -0.222017 -0.024476 -0.684771 0.015417 0.453354 -0.031824 0.471418 -0.462744 -0.122565 0.330138 -0.610633 0.383564 -0.567097 -0.548969 -0.285661 0.379572 -0.382461 -0.847394 0.261396 0.240889 0.259690 0.290077 0.268816 0.287064 0.232473 0.248020 0.232481 0.321314 0.331968
chargesum: 0.00000
title: Mulliken charges with hydrogens summed into heavy atoms:
elementType: O O N N N C C C C C C C C C C C C C C
charge: -0.217041 -0.222017 -0.024476 -0.031489 0.015417 0.453354 -0.031824 0.471418 -0.201348 -0.122565 0.330138 -0.369743 0.383564 -0.307406 -0.258892 -0.016844 0.379572 -0.095397 -0.134420
polarizability: 4.79599434e+02 -2.25685314e+00 1.82220299e+02 -2.50505725e-02 1.32127421e-02 7.26944820e+01
1716.lowfreq: -7.3590 -6.7503 -0.0005 0.0010 0.0011 7.1265 45.8970 56.8371 88.5167
frequency: 45.8932 56.8361 88.4991 122.9445 124.5811 175.8420 199.9789 221.8979 233.3001 270.4567 313.7754 322.3200 344.0723 354.9864 392.5821 419.5946 423.6563 450.8657 471.7693 478.9967 486.7626 517.9546 529.7759 553.0970 598.1002 615.6063 648.1245 682.3632 701.9153 724.5937 742.3509 754.4413 769.7099 795.8854 800.7551 856.9855 864.0281 865.1372 880.9003 914.9148 933.1377 959.8650 1000.2565 1003.2124 1046.1784 1047.5577 1074.2560 1126.2677 1159.1480 1188.0645 1203.3064 1217.1504 1238.9016 1256.1148 1277.4241 1309.1221 1335.1440 1356.1351 1366.8933 1400.2977 1404.2022 1420.5101 1452.0604 1461.1677 1474.7174 1484.6200 1506.4634 1528.2088 1551.9229 1588.6267 1611.7071 1639.5908 1658.4798 2960.3399 3029.9538 3092.7107 3118.7353 3122.7186 3148.6626 3159.8063 3164.2268 3189.5105 3562.6909 3702.2169
redmass: 6.9738 8.6778 4.2400 7.0683 5.9003 2.4427 1.2701 6.0330 5.5148 6.6900 3.1462 2.9888 4.5223 4.7350 1.4498 1.9556 7.2769 5.7669 2.9018 2.6855 1.4409 5.1698 4.7411 4.6693 5.6725 8.2243 7.0992 5.8740 5.3930 6.5145 6.3837 2.8585 6.4936 2.4045 5.9860 1.8253 2.9156 1.3266 1.7903 1.5022 4.3795 1.6424 1.3140 1.5349 1.4202 1.5319 2.3390 1.3802 2.8846 2.0755 2.6605 3.1413 2.2358 1.8383 2.0504 2.1307 3.5344 7.0237 6.3758 1.3105 3.1695 6.7096 2.3275 3.5895 1.0441 1.6342 4.8814 6.4274 7.5350 6.0738 6.8232 1.3844 3.9608 1.0397 1.0976 1.0958 1.0919 1.0921 1.0918 1.0921 1.0890 1.0967 1.0453 1.1035
irintensity: 0.0224 0.0193 0.4675 0.0831 10.1435 0.1045 1.0284 4.2107 0.1360 0.1788 1.8594 0.0395 0.8853 1.4595 53.7223 124.4939 0.9551 9.9515 4.6471 28.5419 79.6427 13.6544 2.6852 0.2552 1.3377 2.2403 2.5160 2.1645 16.3832 2.8860 3.7330 0.2335 14.0881 1.6127 1.4713 37.4443 2.3624 7.9019 38.3583 2.0372 4.6546 49.8587 0.0520 17.0929 6.7561 7.8628 32.2634 16.2198 12.3984 430.2444 350.0305 276.5085 21.9168 18.7386 13.9608 2.5674 76.1345 89.5317 63.6056 16.7979 3.2712 66.6522 11.0900 1.7306 15.0937 19.8424 323.8718 15.2266 106.6116 1.8507 412.9770 86.0578 278.7495 47.4365 20.1588 10.6429 12.4661 12.7095 10.3885 0.2780 4.3015 2.3290 204.5441 31.4051
temp: 298.150 k
press: 1.00000 atm
elementType: 8 8 7 7 7 6 6 6 6 6 6 6 6 6 6 6 6 6 6 1 1 1 1 1 1 1 1 1 1 1
symmnumber: 1
zpe: 588254.9 jmol-1
zpe.correction: 0.224054 hartree
zpe.thermalcorrener: 0.239349 hartree
zpe.thermalcorrenthalpy: 0.240293 hartree
zpe.thermalcorrgfe: 0.181809 hartree
zpe.sumelectzpe: -853.429477 hartree
zpe.sumelectthermal: -853.414183 hartree
zpe.sumelectthermalent: -853.413238 hartree
zpe.sumelectthermalfe: -853.471722 hartree
dipole: -11.4280 -0.2475 0.0002
dipole: 11.4306
quadrupole: -107.5422 -101.8101 -113.5705
quadrupole: 6.4675 -0.0039 0.0016
quadrupole: 0.0988 5.8308 -5.9296 6.4675 -0.0039 0.0016
hfenergy: -853.6535316 hartree
pointgroup: C01 [X(C14H11N3O2)]
dipole: -4.4956714 -0.1156424 0.0000893 debye
polarizability: 479.6128601|-1.0490805|182.2068726|-0.025104|0.0131109|72.694482 unknown
InChI: InChI=1S/C14H11N3O2/c1-8-4-9-5-10-6-11(17(18)19)2-3-13(10)16-14(9)7-12(8)15/h2-7H,15H2,1H3
charge 0 multiplicity 1
30 atoms
O  5.736717 0.296545 -0.000069
O  4.923221 -1.836936 -0.000333
N  -0.493418 1.599254 0.000254
N  -5.306432 1.096188 0.000545
N  4.758278 -0.551964 -0.000435
C  -1.455848 -0.702437 0.000036
C  -1.584203 0.758068 0.000233
C  0.977771 -0.409034 -0.000116
C  -0.162281 -1.25837 -0.000137
C  0.752247 1.038139 0.000085
C  -3.922998 -0.931353 0.000197
C  -2.655675 -1.49775 0.000028
C  -4.03944 0.526489 0.000406
C  -2.886624 1.331471 0.000418
C  2.313289 -0.914029 -0.000284
C  1.899979 1.911242 0.000108
C  3.383163 -0.019481 -0.00026
C  3.19135 1.403619 -0.000057
C  -5.175031 -1.785732 0.000176
H  -0.02966 -2.347586 -0.000286
H  -2.556979 -2.59063 -0.000127
H  -2.956801 2.424165 0.000564
H  2.51127 -1.990631 -0.000443
H  1.708599 2.988117 0.000258
H  4.071253 2.051472 -0.000038
H  -5.801914 -1.595934 -0.894094
H  -4.921277 -2.858056 -0.000074
H  -5.801686 -1.5963 0.894685
H  -5.414583 2.107067 0.000674
H  -6.145689 0.524686 0.000587
