program: Gaussian 09
title: 000153837
version: EM64L-G09RevD.01
frameworkgroup: C1[X(C22H22N8)]
method: RPBEPBE
basis: SDD
operation: Freq
keyword: #pfreq=noraman
keyword: PBEPBE/SDD
title: #p freq=noraman PBEPBE/SDD
converged: YES YES NO NO
title: Mulliken charges:
elementType: N N N N N N N N C C C C C C C C C C C C C C C C C C C C C C H H H H H H H H H H H H H H H H H H H H H H
charge: -0.459665 -0.477112 -0.189042 -0.058823 -0.439938 -0.438316 -0.119686 -0.123589 -0.531834 -0.483109 0.273789 0.120958 0.265223 0.307545 0.051042 -0.030745 0.418268 0.413272 -0.529392 -0.546099 0.101541 0.094482 -0.353338 -0.345267 -0.395510 -0.396665 -0.374611 -0.393369 -0.478737 -0.479128 0.261119 0.225033 0.230917 0.256070 0.315478 0.396473 0.241143 0.234801 0.247394 0.244257 0.221803 0.231101 0.216109 0.225473 0.282116 0.274551 0.232929 0.231686 0.226227 0.225274 0.289510 0.288390
chargesum: 0.00000
title: Mulliken charges with hydrogens summed into heavy atoms:
elementType: N N N N N N N N C C C C C C C C C C C C C C C C C C C C C C
charge: -0.144187 -0.080639 -0.189042 -0.058823 -0.150428 -0.149926 -0.119686 -0.123589 -0.045682 0.003879 0.273789 0.120958 0.265223 0.307545 0.051042 -0.030745 0.418268 0.413272 -0.288249 -0.311298 0.101541 0.094482 -0.105944 -0.101010 0.057394 0.044916 -0.092495 -0.118818 -0.014122 -0.027627
polarizability: 4.57500257e+02 3.59168236e+00 3.64138959e+02 -9.46792994e+00 -7.47735973e+00 1.47005547e+02
1716.lowfreq: -3.9639 -0.0006 0.0007 0.0014 1.2073 5.3148 12.4923 25.6430 31.3908
frequency: 12.4348 25.6253 31.3724 39.4629 53.0278 62.2801 72.7858 80.9114 99.9282 109.0700 127.3837 137.0287 141.9894 169.3915 183.1613 223.0821 230.3101 242.8125 276.9563 284.3998 287.6552 316.5383 354.0719 361.6859 370.5907 399.7954 419.7811 422.6640 432.8378 436.8568 463.0586 490.2940 520.4446 541.1951 549.4491 591.0065 595.7889 607.9788 650.0891 655.4568 679.3645 681.1895 684.7499 690.3496 691.3691 718.0544 730.5331 731.9445 773.9375 778.6958 816.6853 824.1536 831.3351 832.2030 851.1220 852.0003 862.4369 868.5489 874.8075 875.1436 900.0773 910.9582 920.0701 931.9767 941.4571 942.7958 963.5362 969.2802 982.8714 985.5096 988.2756 999.5371 1014.8237 1023.6900 1024.9568 1037.6183 1074.5923 1075.5198 1083.7121 1084.6408 1122.2407 1127.6113 1166.4935 1166.5063 1167.9187 1188.2654 1201.9260 1207.3676 1207.8381 1209.8568 1230.6439 1233.1102 1243.9134 1263.2327 1269.1378 1273.4150 1277.0575 1283.4104 1285.8022 1311.3884 1323.0441 1328.2317 1331.2300 1343.0665 1378.4012 1382.7172 1391.6893 1396.6434 1425.3824 1426.5711 1453.6982 1454.9978 1458.2832 1462.1202 1467.1042 1469.2898 1487.5300 1487.6855 1501.8691 1503.8308 1517.4429 1536.9334 1574.6465 1575.8228 1585.8996 1591.2921 1638.4087 1642.5615 2959.1619 2969.4768 2984.2023 2990.1893 2992.4294 2997.7373 3033.7970 3039.8117 3041.7279 3055.4387 3062.9834 3075.9752 3079.3260 3139.0346 3144.1775 3153.0775 3158.0846 3173.5544 3177.3863 3566.7325 3568.9214 3595.8357
redmass: 5.0486 5.2164 4.1144 4.4498 3.7559 4.3981 5.4690 4.4387 5.3216 4.7650 2.9055 2.2564 2.5201 5.1555 4.7079 4.8376 4.2898 3.3707 4.0707 5.8471 4.9351 4.9182 4.4670 4.7550 4.1553 4.5732 1.5295 1.3698 2.7331 2.4337 3.5385 3.8155 3.6467 4.5318 4.6219 3.7462 4.8746 1.2837 5.2105 4.6815 4.5218 5.8156 4.8614 4.3387 5.0911 5.0875 4.1212 4.1245 3.5810 3.4751 4.8941 4.1984 1.4256 1.4422 1.5483 1.5185 5.4998 5.4703 1.6921 1.7077 3.0377 4.0963 3.9367 3.3778 3.7161 3.6863 3.8475 3.6093 1.3780 2.7392 1.3948 3.2649 1.2306 3.3988 3.2697 3.3641 1.9803 1.9027 2.1305 2.2081 1.5692 1.5314 1.1855 1.2011 1.1406 1.3679 2.4397 1.1208 2.2760 1.1005 1.8569 1.7230 1.9135 1.3219 1.3859 1.5358 1.6722 1.5985 1.5503 1.5227 1.6583 1.9868 2.1325 2.1810 3.5094 4.3449 3.0254 2.4946 2.4802 2.4307 1.1010 1.6839 2.3207 1.5150 1.3659 1.3821 3.3510 3.7712 1.1863 1.2116 3.7396 3.0004 6.5663 6.6095 7.8541 7.9001 7.1298 6.9482 1.0654 1.0647 1.0623 1.0657 1.0650 1.0651 1.0954 1.0999 1.0969 1.1039 1.1043 1.0961 1.0953 1.0920 1.0924 1.0882 1.0887 1.0971 1.0973 1.0785 1.0784 1.0815
irintensity: 0.0627 2.4563 10.8160 0.9995 0.6312 0.2032 0.4386 1.1432 1.6436 0.0534 0.6100 0.3399 1.5679 2.4447 1.6609 6.8096 23.3467 12.5279 3.1008 3.8607 3.0088 6.0168 9.6820 13.4383 18.5897 27.4174 120.6754 74.0188 29.9232 7.1363 9.9479 15.1502 0.1175 2.4280 6.4680 8.8232 2.8116 76.1825 13.3956 8.6604 11.6699 2.5936 15.4192 23.3065 0.4450 9.5492 7.8092 8.2769 1.4418 0.8814 13.3758 2.6880 2.0782 2.0427 38.9585 24.8127 4.8939 4.8762 12.9909 33.8001 2.7028 20.7993 2.4611 2.8703 15.3378 19.5488 14.5212 22.6117 3.7422 27.4305 1.0674 1.6586 78.2693 6.6932 12.2859 5.8362 8.2183 7.6827 12.8157 16.5934 16.2475 12.5118 5.9766 8.2191 4.3989 39.4305 40.0769 1.0034 16.3672 0.4483 7.1012 16.7316 9.0471 39.2043 58.7844 21.7122 87.3128 16.3204 27.7446 4.5425 18.7780 52.7884 151.7604 145.2490 27.2072 12.1399 33.2228 6.0603 114.5721 142.6124 8.8187 35.5587 46.3148 13.8143 6.7086 19.6748 20.2820 4.9838 14.1346 17.6110 20.9763 119.5710 102.9204 61.7532 58.3602 17.7657 19.5264 6.5349 88.0375 90.2231 28.1276 85.5424 18.9539 70.2358 52.6459 25.2942 48.7838 54.6078 48.5144 2002.8318 15.8964 13.7269 7.4079 2.0394 1.6759 6.7069 4.1480 8.4270 6.7510 52.6107
temp: 298.150 k
press: 1.00000 atm
elementType: 7 7 7 7 7 7 7 7 6 6 6 6 6 6 6 6 6 6 6 6 6 6 6 6 6 6 6 6 6 6 1 1 1 1 1 1 1 1 1 1 1 1 1 1 1 1 1 1 1 1 1 1
symmnumber: 1
zpe: 1089246.3 jmol-1
zpe.correction: 0.414872 hartree
zpe.thermalcorrener: 0.439655 hartree
zpe.thermalcorrenthalpy: 0.440599 hartree
zpe.thermalcorrgfe: 0.357233 hartree
zpe.sumelectzpe: -1287.471458 hartree
zpe.sumelectthermal: -1287.446675 hartree
zpe.sumelectthermalent: -1287.445730 hartree
zpe.sumelectthermalfe: -1287.529097 hartree
dipole: 11.2751 -1.6276 -0.8684
dipole: 11.4250
quadrupole: -166.5461 -156.2282 -178.2873
quadrupole: -37.4860 5.0854 -10.0226
quadrupole: 0.4745 10.7923 -11.2668 -37.4860 5.0854 -10.0226
hfenergy: -1287.8863295 hartree
pointgroup: C01 [X(C22H22N8)]
dipole: -4.4894981 0.1686651 -0.1431438 debye
polarizability: 455.8793095|8.9364626|344.9589212|-13.4436551|-64.5305513|167.8065323 unknown
InChI: InChI=1S/C22H22N8/c1-3-15-17(11-13(1)21-23-7-8-24-21)29-19(27-15)5-6-20-28-16-4-2-14(12-18(16)30-20)22-25-9-10-26-22/h1-4,11-12,23,25,29-30H,5-10H2
charge 0 multiplicity 1
52 atoms
N  -2.792273 2.426958 -0.082062
N  1.700593 1.550942 -0.953531
N  -0.966722 1.11945 -0.389209
N  2.900715 3.341951 -1.728142
N  -7.081147 -0.824642 0.798272
N  5.203768 -2.396315 0.365469
N  -5.931446 -2.744832 1.370342
N  7.127321 -1.126945 0.512783
C  -0.631446 3.642816 -0.641688
C  0.385678 3.550972 -1.820856
C  -1.426884 2.388647 -0.383676
C  1.669262 2.833343 -1.502365
C  -3.237684 1.109532 0.118733
C  3.044906 1.195134 -0.809533
C  -2.072196 0.297595 -0.07959
C  3.787011 2.328322 -1.302436
C  -4.572078 -0.842122 0.5753
C  5.096081 0.026097 -0.309886
C  -4.493957 0.567101 0.445897
C  3.678344 0.040672 -0.30983
C  -5.852102 -1.506313 0.912842
C  5.844803 -1.151322 0.184628
C  -2.162534 -1.106872 0.061018
C  5.202187 2.300617 -1.286258
C  -8.184621 -1.785221 1.058229
C  6.226002 -3.417839 0.701256
C  -3.411295 -1.659238 0.387729
C  5.840191 1.152302 -0.790392
C  -7.384484 -3.016231 1.627054
C  7.475737 -2.505142 0.991641
H  -0.084902 3.931371 0.277834
H  -1.340893 4.465135 -0.856005
H  -0.112878 3.081674 -2.691723
H  0.674696 4.572256 -2.121186
H  -3.356151 3.272967 -0.021042
H  0.815944 1.054885 -0.689043
H  -5.364654 1.202573 0.6381
H  3.101826 -0.793882 0.103205
H  -1.281357 -1.739105 -0.080448
H  5.774463 3.158132 -1.652549
H  -8.723449 -2.038996 0.122904
H  -8.911701 -1.382162 1.784307
H  6.405872 -4.103749 -0.152247
H  5.929826 -4.01995 1.578258
H  -3.534781 -2.738461 0.516799
H  6.931422 1.084165 -0.75149
H  -7.534761 -3.121906 2.718069
H  -7.678458 -3.970467 1.156365
H  7.691939 -2.458767 2.076311
H  8.38945 -2.862352 0.484687
H  -7.207677 -0.047657 0.149582
H  4.363892 -2.645522 -0.156625
