program: Gaussian 09
title: 000153835
version: EM64L-G09RevD.01
frameworkgroup: C1[X(C9H11NO2)]
method: RPBEPBE
basis: SDD
operation: Freq
keyword: #p
keyword: freq=noraman
keyword: PBEPBE/SDD
title: #p freq=noraman PBEPBE/SDD
converged: YES YES NO NO
title: Mulliken charges:
elementType: O O N C C C C C C C C C H H H H H H H H H H H
charge: -0.469499 -0.253562 -0.454419 0.199429 0.405519 0.159794 -0.426257 -0.816330 -0.390552 -0.209148 0.210372 -0.775531 0.232771 0.324518 0.218785 0.294508 0.215064 0.220849 0.225966 0.250963 0.255636 0.215784 0.365338
chargesum: 0.00000
title: Mulliken charges with hydrogens summed into heavy atoms:
elementType: O O N C C C C C C C C C
charge: -0.104160 -0.253562 -0.129901 0.199429 0.405519 0.159794 -0.193487 -0.087973 -0.169703 0.016818 0.210372 -0.053147
polarizability: 1.51021268e+02 -1.73976826e-01 1.22247943e+02 5.20078304e+00 1.99041600e+00 6.27197556e+01
1716.lowfreq: -15.0123 -3.8320 -0.0008 -0.0007 -0.0006 9.2803 53.0537 74.0177 83.2834
frequency: 53.0310 74.0073 83.2776 113.4021 169.1064 198.1886 229.8254 275.7496 299.8108 309.9121 335.3074 362.3247 480.5282 496.2390 513.3513 531.1561 555.8371 588.2011 598.0352 637.7266 706.7020 731.9867 763.1597 832.9562 859.3405 909.9472 952.4762 957.0685 993.2980 1016.3698 1038.4247 1051.4637 1091.0056 1152.7879 1177.7672 1215.0868 1250.7148 1255.1714 1291.7658 1385.3809 1390.9079 1399.3300 1441.5890 1447.8133 1451.6341 1468.4756 1477.1390 1495.7350 1498.2342 1596.1371 1620.5515 1634.8755 2980.0907 2994.3974 3062.5810 3087.0568 3090.6221 3111.4253 3119.3364 3135.6938 3162.0837 3510.4728 3605.8100
redmass: 1.1162 5.1368 3.0008 4.2913 1.5849 2.0663 3.1207 4.5781 3.0865 2.4860 1.3825 3.4597 3.5651 4.3618 3.9078 5.2843 3.8023 3.7153 2.8000 1.5368 3.7146 2.9847 1.6859 4.8189 1.3475 4.3638 1.4838 2.3889 1.5858 2.0609 1.6461 1.5422 1.6689 1.3473 1.2462 3.6655 2.5147 2.0175 2.2774 1.2222 5.9386 1.2562 1.9471 1.1100 1.1003 1.0913 1.2866 2.7527 1.7733 6.0111 7.2913 4.9947 1.0365 1.0365 1.0965 1.0990 1.1001 1.0993 1.0883 1.0898 1.0991 1.0758 1.0662
irintensity: 0.7462 5.3789 3.3221 0.6365 5.1535 5.1149 3.0389 7.5531 4.4003 44.9625 92.0621 4.1109 4.5344 12.6615 3.9646 3.0140 1.7293 5.9436 6.3951 69.9380 34.4583 27.3431 53.2272 6.6581 0.0728 15.6407 10.7555 31.2790 7.1641 58.1570 19.2130 9.6983 16.6003 88.0094 21.0896 25.6373 57.7346 48.5303 60.7172 64.0767 34.1963 34.9777 65.7968 40.3184 29.3088 20.1510 58.7872 67.4260 194.8913 28.9114 32.6133 108.6914 25.0214 12.6621 12.5489 17.3053 16.8571 12.2017 9.3292 14.5429 23.1110 31.2775 37.3343
temp: 298.150 k
press: 1.00000 atm
elementType: 8 8 7 6 6 6 6 6 6 6 6 6 1 1 1 1 1 1 1 1 1 1 1
symmnumber: 1
zpe: 480419.6 jmol-1
zpe.correction: 0.182982 hartree
zpe.thermalcorrener: 0.195033 hartree
zpe.thermalcorrenthalpy: 0.195978 hartree
zpe.thermalcorrgfe: 0.144840 hartree
zpe.sumelectzpe: -553.884075 hartree
zpe.sumelectthermal: -553.872023 hartree
zpe.sumelectthermalent: -553.871079 hartree
zpe.sumelectthermalfe: -553.922216 hartree
dipole: 1.6491 -3.1328 -2.1711
dipole: 4.1530
quadrupole: -61.5766 -61.1180 -76.3927
quadrupole: 0.8630 6.7312 -2.4395
quadrupole: 4.7858 5.2445 -10.0303 0.8630 6.7312 -2.4395
hfenergy: -554.0670569 hartree
pointgroup: C01 [X(C9H11N1O2)]
dipole: -0.5271559 -1.1691381 1.0123473 debye
dipolederiv: -0.3070772 0.5153062 -0.0412992 0.3526186 -1.1188501 0.1823132 -0.0173705 0.2079854 -0.4413038 -0.6563946 0.0287427 -0.0521028 -0.2736323 -0.6004778 0.2862006 0.3248979 0.3056588 -0.737032 -1.4452431 -0.2009297 0.1467736 -0.2664932 -0.3417699 0.0054045 0.2573078 0.0900311 -0.4893419 0.7921977 -0.0640216 0.0967121 -0.0614131 -0.2239677 0.102515 0.2040975 0.0435583 0.0124741 0.0955457 0.1440415 0.0470301 0.1254959 0.3012442 0.0380455 -0.0396243 0.0144014 -0.0041659 0.1079846 -0.38151 0.0999985 -0.3229077 1.0037131 -0.2147929 0.1024138 -0.2284624 0.1023066 -0.1448434 -0.1489315 0.0207453 -0.118117 -0.0775987 -0.0435108 0.0066785 -0.069677 -0.1934797 -0.0523536 -0.1728549 0.00391 -0.1104973 -0.0896376 0.0023153 0.0344616 0.046581 0.0157201 -0.134167 0.245493 -0.0183114 -0.0020001 -0.1454768 -0.0049329 0.0276549 0.0680195 -0.218665 0.0184921 -0.0439561 0.0587307 0.0825173 0.1385115 -0.0131744 0.0405278 -0.0398531 -0.1196718 1.641794 0.1456469 -0.0860845 0.6594834 0.5860649 -0.5078038 -0.4545332 -0.5164581 0.8533421 -0.4046568 0.0709405 -0.1371182 -0.0185743 0.0354831 -0.0026731 -0.1781322 0.0259367 -0.0380129 0.0430544 0.0559082 -0.0288724 0.0953514 -0.0766907 0.0346944 -0.0316904 0.024022 0.150026 0.1583327 0.0175734 -0.0027617 0.0001193 0.2049902 0.0832259 -0.0818274 0.0468788 0.2663767 0.0319684 -0.0306281 -0.1131036 -0.0173552 0.04506 0.0363926 -0.1091505 -0.0459044 -0.0589907 0.0881124 -0.077115 0.064528 -0.052733 0.0968379 -0.0100097 0.0532556 0.0279197 0.0366312 -0.0397701 0.1788499 0.0043382 0.0761967 -0.0632806 -0.0239614 -0.007391 -0.030772 0.1099098 0.0481842 -0.064806 -0.020443 -0.0959931 -0.1077551 0.0093546 -0.0277356 0.0220371 0.1696412 -0.1146898 -0.0050431 -0.0654644 -0.0018283 0.0848556 0.0050761 -0.0648285 0.0095534 0.1434509 0.0485342 -0.0264863 -0.0362781 -0.0534901 -0.0244698 -0.0804739 -0.0799962 -0.0593557 0.0592757 0.0276764 0.032515 0.063345 0.0614414 0.1033396 -0.0041551 0.1178457 -0.0323009 -0.0085323 0.0598583 -0.0426312 0.0263506 0.0332654 -0.0493572 0.1361832 -0.0236559 0.1238279 0.010702 0.1374605 -0.1761038 -0.0306227 -0.0914549 0.3192319 -0.0162329 -0.0532053 -0.0336276 0.3793395 unknown
polarizability: 149.1896474|6.0161495|121.170517|10.7659735|-9.9157915|65.6288025 unknown
InChI: InChI=1S/C9H11NO2/c1-6-4-3-5-8(12)9(6)10-7(2)11/h3-5,10,12H,1-2H3
charge 0 multiplicity 1
23 atoms
O  -0.20656 -2.426642 0.539462
O  2.201577 1.17397 -1.035036
N  1.210439 -0.180982 0.611184
C  -0.169549 -0.045695 0.263399
C  -0.820021 1.200261 0.037202
C  -0.925948 -1.251346 0.219798
C  -2.199283 1.180635 -0.304297
C  -0.100536 2.520911 0.20471
C  -2.295914 -1.254655 -0.101923
C  -2.9288 -0.023172 -0.384002
C  2.305268 0.387045 -0.050047
C  3.662576 -0.004899 0.534436
H  -2.704851 2.134545 -0.490308
H  1.414716 -0.984229 1.213106
H  0.515414 2.523788 1.123658
H  0.594749 2.69661 -0.635244
H  -0.821814 3.35341 0.265156
H  -2.857778 -2.196517 -0.139846
H  -3.991943 -0.006165 -0.645723
H  4.082568 0.856246 1.084895
H  4.352348 -0.235254 -0.293648
H  3.617033 -0.867516 1.221911
H  -0.791291 -3.221248 0.489659
