program: Gaussian 09
title: 000013737
version: EM64L-G09RevD.01
frameworkgroup: C1[X(C16H16O2)]
method: RPBEPBE
basis: SDD
operation: Freq
keyword: #pfreq=noraman
keyword: PBEPBE/SDD
title: #p freq=noraman PBEPBE/SDD
converged: YES YES NO NO
title: Mulliken charges:
elementType: O O C C C C C C C C C C C C C C C C H H H H H H H H H H H H H H H H
charge: -0.409113 -0.236627 -0.310522 0.495237 -0.387164 -0.458444 -0.388626 0.349817 -0.690007 -0.397847 -0.407022 0.152899 0.340464 -0.397365 -0.396130 -0.235634 -0.235765 -0.241934 0.242989 0.230253 0.211345 0.234278 0.260039 0.205769 0.236333 0.220831 0.239090 0.238482 0.237838 0.239471 0.225438 0.225864 0.375946 0.229816
chargesum: 0.00000
title: Mulliken charges with hydrogens summed into heavy atoms:
elementType: O O C C C C C C C C C C C C C C C C
charge: -0.033167 -0.236627 -0.067533 0.495237 0.054435 -0.224166 -0.128586 0.349817 -0.027073 -0.158757 -0.168540 0.152899 0.340464 -0.159527 -0.156659 -0.010196 -0.009902 -0.012118
polarizability: 2.80014535e+02 -5.41708189e-01 1.48027257e+02 -1.79936057e+00 2.49270125e+01 1.26982536e+02
1716.lowfreq: -9.2688 -2.6575 0.0004 0.0007 0.0011 9.4223 28.4000 33.5149 43.3587
frequency: 26.7281 33.4811 43.3513 70.1528 80.7617 82.5278 120.1072 139.4217 161.5512 215.2765 248.4440 271.9312 308.1008 333.2149 358.0151 404.2655 408.7807 413.1198 449.1535 502.3589 546.2103 578.0408 604.1421 614.6097 627.4081 638.5654 685.1188 702.0265 722.9341 744.9509 762.4563 773.9689 835.8847 840.4669 849.0800 850.2547 884.2307 918.5939 929.3431 961.6881 973.6474 974.7466 988.5031 993.8224 996.2362 1017.0292 1033.0161 1040.6018 1052.6894 1083.5752 1084.9160 1105.9079 1131.8047 1173.4855 1191.0921 1192.8649 1209.3337 1227.0767 1238.2056 1290.1632 1296.4171 1306.6877 1316.9707 1326.1555 1346.6983 1372.1767 1377.0668 1393.4239 1413.4255 1439.2321 1467.8093 1476.2556 1476.9439 1483.4495 1514.7083 1567.9218 1588.8933 1612.8715 1619.2176 1654.8025 2979.5867 2992.7773 3032.8434 3052.1289 3076.5915 3085.3177 3120.7536 3122.6823 3126.5592 3128.4764 3139.9409 3144.6825 3148.9745 3151.7814 3164.9487 3499.8540
redmass: 4.2840 5.3013 6.2506 3.7091 2.7307 5.2575 4.1626 2.7426 3.4497 2.1676 1.8302 5.4748 4.1119 4.3475 4.5424 2.8467 2.8595 4.3092 3.9313 3.4697 2.9484 2.5764 3.0189 5.8631 2.0592 6.0013 3.2104 1.7437 2.8833 3.2092 2.2902 2.1405 1.8245 1.6184 1.3140 1.2643 2.4691 1.5166 2.8076 1.4517 1.4200 1.4223 4.9021 1.3167 6.5746 2.8229 1.8596 1.9260 2.2447 1.9746 1.6332 1.9752 1.5590 1.0526 1.1391 1.6691 1.3533 1.4490 1.3353 2.9561 1.3390 1.5341 1.5331 1.3427 1.7378 3.2663 4.3970 1.2159 3.3130 2.3819 1.0791 2.0967 1.0478 1.0616 2.8082 5.9218 6.4978 6.0432 6.2842 8.2544 1.0363 1.0620 1.0876 1.0967 1.0992 1.1005 1.0868 1.0851 1.0874 1.0873 1.0921 1.0957 1.0961 1.0966 1.1016 1.0638
irintensity: 0.2466 0.9548 1.8962 0.0164 0.2619 0.2833 0.3245 0.2465 1.3695 0.3007 0.3518 0.6313 0.6281 2.7055 7.3269 0.2473 0.0573 0.3176 8.4017 11.0878 15.1621 32.1927 55.6354 4.3536 54.7776 3.6872 49.5218 47.3911 25.5795 30.9571 16.8490 49.8859 9.3605 30.3566 8.3984 1.5650 6.6218 0.5770 17.9100 3.2697 0.4998 0.1274 0.3751 0.1028 13.5154 3.4917 137.7582 10.2516 116.7468 6.5134 10.3766 27.5168 20.6865 0.0260 0.4691 0.3893 0.4306 2.8930 2.4712 0.0601 2.4832 4.8200 39.0817 3.8888 29.3267 4.7645 5.4482 12.6790 8.4406 4.5621 5.9702 56.2530 6.0894 12.0402 10.5632 0.8314 1.7602 7.5662 3.5964 187.4592 28.3566 34.2541 3.3636 8.9121 44.1793 60.4975 19.9161 0.7737 6.5744 5.0558 13.0772 11.8917 49.2783 1.1818 26.8819 21.5761
temp: 298.150 k
press: 1.00000 atm
elementType: 8 8 6 6 6 6 6 6 6 6 6 6 6 6 6 6 6 6 1 1 1 1 1 1 1 1 1 1 1 1 1 1 1 1
symmnumber: 1
zpe: 722296.0 jmol-1
zpe.correction: 0.275108 hartree
zpe.thermalcorrener: 0.291572 hartree
zpe.thermalcorrenthalpy: 0.292516 hartree
zpe.thermalcorrgfe: 0.229047 hartree
zpe.sumelectzpe: -768.484110 hartree
zpe.sumelectthermal: -768.467647 hartree
zpe.sumelectthermalent: -768.466702 hartree
zpe.sumelectthermalfe: -768.530172 hartree
dipole: 0.3661 0.9318 0.9291
dipole: 1.3658
quadrupole: -94.9966 -100.6282 -107.1758
quadrupole: -2.5566 -4.8323 1.3856
quadrupole: 5.9369 0.3054 -6.2423 -2.5566 -4.8323 1.3856
hfenergy: -768.7592183 hartree
pointgroup: C01 [X(C16H16O2)]
dipole: 0.1465014 0.3026954 0.4191322 debye
polarizability: 279.9965432|-1.9630997|139.7695866|-1.1682115|26.9789597|135.2581979 unknown
InChI: InChI=1S/C16H16O2/c1-2-15(16(17)18)14-10-8-13(9-11-14)12-6-4-3-5-7-12/h3-11,15,17H,2H2,1H3
charge 0 multiplicity 1
34 atoms
O  -4.284751 -1.587346 1.363964
O  -4.070666 -1.644292 -0.945333
C  -3.282762 0.34939 0.309986
C  -1.753255 0.229139 0.243526
C  -3.856554 1.323605 -0.764304
C  -0.948101 0.681376 1.316858
C  -1.110877 -0.315315 -0.898354
C  1.110233 0.059181 0.110456
C  -3.362387 2.771098 -0.573877
C  0.458406 0.599612 1.251902
C  0.29375 -0.396931 -0.961729
C  -3.903895 -1.032456 0.13374
C  2.597399 -0.031226 0.041839
C  3.420579 0.950918 0.659982
C  3.234501 -1.10355 -0.642529
C  4.827657 0.864559 0.596796
C  4.641363 -1.190547 -0.708116
C  5.446616 -0.206832 -0.088383
H  -3.562748 0.711113 1.315201
H  -3.581114 0.949056 -1.767223
H  -4.962593 1.295664 -0.71137
H  -1.425296 1.090622 2.215354
H  -1.714439 -0.682825 -1.736319
H  -3.659883 3.169775 0.41453
H  -2.26192 2.832379 -0.646386
H  -3.792289 3.433158 -1.346996
H  1.055272 0.928889 2.109839
H  0.765625 -0.795278 -1.866985
H  2.955508 1.804309 1.166764
H  2.62455 -1.89118 -1.099356
H  5.440979 1.63779 1.073162
H  5.109236 -2.030769 -1.233524
H  -4.650251 -2.501746 1.210416
H  6.539004 -0.274141 -0.138329
