program: Gaussian 09
title: 000153801
version: EM64L-G09RevD.01
frameworkgroup: C1[X(C7H10ClF2NO3S)]
method: RPBEPBE
basis: SDD
operation: Freq
keyword: #p
keyword: freq=noraman
keyword: PBEPBE/SDD
title: #p freq=noraman PBEPBE/SDD
converged: YES YES NO NO
title: Mulliken charges:
elementType: Cl S F F O O O N C C C C C C C H H H H H H H H H H
charge: -0.001933 0.214595 -0.163698 -0.158319 -0.437266 -0.204444 -0.280205 -0.393363 -0.098476 -0.697447 0.123998 0.174379 0.266384 -0.592300 -0.770456 0.307254 0.326197 0.320561 0.353756 0.296808 0.284590 0.254994 0.256736 0.217487 0.400166
chargesum: 0.00000
title: Mulliken charges with hydrogens summed into heavy atoms:
elementType: Cl S F F O O O N C C C C C C C
charge: -0.001933 0.214595 -0.163698 -0.158319 -0.037100 -0.204444 -0.280205 -0.039607 0.208778 -0.050690 0.123998 0.174379 0.266384 -0.010902 -0.041238
polarizability: 1.54400730e+02 1.86704702e+01 1.03122163e+02 -5.63235161e+00 1.75525167e+00 1.00600847e+02
1716.lowfreq: -11.9596 -8.0831 -0.0031 -0.0027 -0.0023 3.0615 21.6861 28.7273 32.2968
frequency: 21.5077 28.3209 32.2356 50.3424 60.0772 66.2680 72.1434 88.7913 108.3618 144.7371 173.7970 189.6597 246.9726 264.8799 289.7380 323.9453 352.0448 374.2044 392.1228 436.9784 481.9691 512.3472 524.3423 569.6415 601.4187 608.0845 612.6354 651.3858 680.4082 708.3898 727.2907 811.4868 827.8249 875.8942 908.8507 937.4675 971.8347 982.0665 992.6048 1043.9988 1083.1934 1142.9030 1146.1640 1192.2276 1201.7010 1233.5605 1242.7170 1284.1140 1294.8390 1321.0743 1331.0363 1389.9074 1426.5756 1428.8951 1449.7736 1461.6220 1480.1020 1605.7903 1680.5485 2986.6718 2999.7462 3051.7964 3076.0157 3099.8606 3104.2767 3133.8014 3160.8631 3533.4083 3561.5905
redmass: 8.9772 8.9335 3.6436 1.5428 4.6106 8.7127 5.1008 4.6732 6.8630 5.5703 7.6936 6.3220 6.2643 7.2796 7.7347 3.2467 4.3078 4.3381 8.7537 3.6051 8.9193 3.9698 3.3600 1.5314 2.7756 2.2597 2.3801 2.6180 9.4763 7.4982 4.8965 3.3468 2.7659 7.0022 2.5494 4.5953 2.8350 2.0269 1.5638 1.6560 1.7694 4.0004 5.6959 1.1754 1.2419 1.3244 1.4880 1.2465 1.6537 1.3771 2.1468 1.2298 1.0837 1.0901 1.0455 1.2409 1.7663 6.4488 9.4960 1.0814 1.0360 1.0577 1.0574 1.0978 1.1012 1.1081 1.1097 1.0644 1.0788
irintensity: 2.8049 0.6909 2.8231 1.1147 7.3991 1.9340 6.0057 2.3748 1.7184 8.0802 0.1792 2.3180 4.7232 3.9238 0.7417 3.3351 2.0667 0.9126 0.5541 12.9091 5.9159 28.9736 65.8919 8.8119 130.5438 66.0346 5.2861 82.4355 99.1932 16.3548 11.7319 15.7263 40.2558 128.5512 34.4981 15.2851 21.1207 115.1692 3.0999 14.7511 165.1638 24.7756 20.4081 16.0922 16.9950 2.7494 22.0803 7.6128 43.0849 36.5330 23.3553 68.5408 30.4010 21.4708 15.7465 154.7267 205.6550 150.1645 199.8408 9.1865 8.0338 1.6527 6.7952 6.8002 18.4606 3.4530 0.3448 40.4460 55.7454
temp: 298.150 k
press: 1.00000 atm
elementType: 17 16 9 9 8 8 8 7 6 6 6 6 6 6 6 1 1 1 1 1 1 1 1 1 1
symmnumber: 1
zpe: 453694.8 jmol-1
zpe.correction: 0.172803 hartree
zpe.thermalcorrener: 0.190342 hartree
zpe.thermalcorrenthalpy: 0.191286 hartree
zpe.thermalcorrgfe: 0.123413 hartree
zpe.sumelectzpe: -1609.816037 hartree
zpe.sumelectthermal: -1609.798498 hartree
zpe.sumelectthermalent: -1609.797554 hartree
zpe.sumelectthermalfe: -1609.865427 hartree
dipole: -1.2827 -1.4622 -3.8868
dipole: 4.3463
quadrupole: -111.4575 -99.8979 -99.5016
quadrupole: -8.7442 9.8426 -2.7716
quadrupole: -7.8385 3.7211 4.1174 -8.7442 9.8426 -2.7716
hfenergy: -1609.9888403 hartree
pointgroup: C01 [X(C7H10Cl1F2N1O3S1)]
dipole: -0.4910315 0.4724105 1.5683637 debye
dipolederiv: -0.4575019 0.1319788 -0.0817546 0.231783 -0.2330547 0.0455479 -0.0721397 0.0151126 -0.1288701 -0.5097374 0.0897142 -0.0603834 0.0704912 -0.1458371 0.1099965 -0.2079693 0.0743443 -0.1563013 -0.446539 -0.1159068 0.0457499 0.0207436 -0.7446199 0.2444457 -0.020926 0.2085718 -0.3630151 -0.4630256 0.077166 0.0714489 0.1265249 -0.3371903 -0.1354624 0.1707314 -0.1299454 -0.6734269 -0.4164453 -0.074939 0.1214765 -0.1431435 -0.4245115 0.2467458 0.2122721 0.1703886 -1.0610318 -0.385552 0.141884 0.1722596 0.129129 -0.7634905 -0.2956272 0.1130087 -0.065163 -0.6819959 -0.5965867 0.1751783 0.0428192 0.2610267 -0.6531917 0.0956598 -0.1338476 0.2896409 -0.8518915 -0.9211011 0.38336 0.0058045 0.4238431 -0.9524736 0.0544621 0.0336883 0.0927793 -0.3890767 0.3427504 -0.0819319 -0.1207321 -0.1188742 0.0237918 0.0989604 -0.4067064 0.3118541 0.1173653 0.3391753 0.2418883 0.1787917 0.2557743 -0.063438 -0.0032906 0.3650844 -0.0713674 0.1450203 1.2066161 -0.0980997 -0.052534 -0.3231281 1.0790924 -0.1709375 -0.1340563 -0.1459218 0.9739697 0.2959053 -0.2629437 -0.2616275 -0.068606 1.1272863 0.0476528 -0.3023605 -0.1358429 1.3530632 0.8903545 -0.6794946 -0.0823295 -0.8445232 1.1030605 -0.157878 0.0484628 -0.3006633 0.9954392 0.36281 -0.3288802 0.0025501 -0.2905335 0.2531774 -0.0578183 0.0716999 -0.0613863 0.0755333 -0.1490512 0.1290033 0.1697056 0.1469776 -0.099086 -0.1617196 0.1746003 -0.1461045 -0.1684587 -0.0033114 -0.022998 -0.0620027 -0.052707 0.084851 -0.0059155 0.0608196 -0.0779267 0.0361158 0.0709791 -0.0195054 -0.0805498 -0.0779669 0.0204317 0.019153 -0.0836672 0.0322271 0.0805915 -0.0047733 0.0154637 0.0089932 -0.0199057 0.1056603 -0.0768614 0.0032878 -0.0518186 0.037307 0.2986078 0.0352159 0.0062076 0.0678701 0.2979432 0.0121487 0.0431874 -0.0196323 0.1675661 0.0150731 0.0496308 -0.0019868 0.0401214 -0.0135953 0.0618127 0.0118192 0.0731958 0.0749195 0.0374691 0.091153 0.0465956 0.0744918 0.0520045 -0.0315785 0.0319717 -0.0354661 0.0118487 0.1140493 -0.0780651 -0.0093317 -0.0426908 -0.0573539 -0.0281789 0.0299443 -0.0082435 0.0823399 -0.0772021 0.0144914 -0.0164033 -0.015394 0.1321892 0.0058186 -0.0499609 -0.0143465 0.0766403 0.0927365 0.047491 -0.0441756 0.0334187 0.0287321 0.1194646 0.0081236 0.0625388 -0.0879976 0.3643007 0.139146 0.0014086 0.1152775 0.1796217 -0.0366008 0.0329322 -0.0668249 0.334346 unknown
polarizability: 140.0310186|-29.9612952|116.3675829|5.7729541|-0.6932248|101.7251391 unknown
InChI: InChI=1S/C7H10ClF2NO3S/c1-4(12)11-5(6(13)14)2-15-7(9,10)3-8/h5,11,13H,2-3H2,1H3
charge 0 multiplicity 1
25 atoms
Cl 4.909707 -1.135067 0.966018
S  1.008267 1.035069 0.319972
F  1.869839 -1.520984 0.840237
F  2.550674 -0.680633 -1.159188
O  -1.266168 -1.987246 1.100867
O  -0.561115 -2.522182 -1.051994
O  -3.007933 1.982929 -0.998064
N  -2.151006 0.407833 0.464379
C  -1.413517 -0.264367 -0.606102
C  -0.166616 0.532768 -1.082297
C  2.319614 -0.313462 0.204199
C  -1.036177 -1.698813 -0.248115
C  -2.934905 1.514814 0.18207
C  3.602998 0.194169 0.850359
C  -3.68805 2.119099 1.359014
H  -2.068606 -0.312154 -1.500946
H  -0.508819 1.487779 -1.510555
H  0.411192 -0.034378 -1.828961
H  -2.083959 0.01572 1.405142
H  4.02741 1.006021 0.244487
H  3.402846 0.530377 1.878261
H  -3.385901 3.17357 1.479696
H  -4.768631 2.113829 1.135328
H  -3.516185 1.586365 2.309734
H  -0.933559 -2.900456 1.311857
