program: Gaussian 09
title: 000153781
version: EM64L-G09RevD.01
frameworkgroup: C1[X(C5H13NO3S)]
method: RPBEPBE
basis: SDD
operation: Freq
keyword: #p
keyword: freq=noraman
keyword: PBEPBE/SDD
title: #p freq=noraman PBEPBE/SDD
converged: YES YES NO NO
title: Mulliken charges:
elementType: S O O O N C C C C C H H H H H H H H H H H H H
charge: 1.144333 -0.412427 -0.508744 -0.509855 -0.556724 -0.048327 -0.655963 -0.652234 -0.220641 -0.657200 0.261632 0.327882 0.217095 0.200162 0.259183 0.249401 0.218945 0.204163 0.232207 0.225340 0.217451 0.231905 0.232415
chargesum: 0.00000
title: Mulliken charges with hydrogens summed into heavy atoms:
elementType: S O O O N C C C C C
charge: 1.144333 -0.412427 -0.508744 -0.509855 -0.228841 0.213306 0.020477 0.020275 0.236906 0.024570
polarizability: 1.34915499e+02 -9.51290030e-01 9.67490976e+01 9.01515209e-01 1.39470625e+00 8.41605541e+01
1716.lowfreq: -17.7682 -4.8978 -0.0030 -0.0021 -0.0020 5.8858 17.2505 47.3780 54.7582
frequency: 13.7141 47.2904 54.6837 62.3435 109.6999 138.4194 204.2280 212.7246 225.9369 234.2266 245.9011 258.7565 279.5112 319.1013 365.0205 397.9638 414.2651 442.2037 485.6377 554.0849 744.9924 820.1193 828.7347 832.0115 861.4611 925.8257 934.6754 944.5960 975.1067 1010.8503 1097.0527 1131.3871 1137.4260 1144.8723 1164.7786 1245.5545 1287.7076 1307.3344 1349.2325 1380.9364 1388.6561 1389.1709 1401.5629 1455.6438 1461.7338 1464.7876 1476.3662 1478.7598 1483.4884 1492.0350 2979.8740 2986.0938 2986.5571 2993.9457 3028.8695 3051.9847 3074.4115 3084.4268 3090.6786 3097.0304 3108.9609 3109.4021 3441.8604
redmass: 2.8898 3.3483 2.0017 4.1759 3.9096 4.8569 1.0394 4.7495 1.9451 1.4945 1.5402 3.3106 3.5376 3.0061 3.3886 4.5096 1.8351 4.0238 6.6609 7.5711 2.5397 1.0828 3.1987 2.7072 8.1040 1.2327 1.7899 1.7269 11.7101 2.8632 2.1804 2.1345 1.4092 2.2053 1.8392 1.1540 1.2241 1.3982 1.2570 1.1942 1.1964 1.2159 1.1888 1.0406 1.0469 1.0495 1.0486 1.0464 1.0516 1.0826 1.0362 1.0393 1.0508 1.0377 1.0849 1.1088 1.0993 1.0981 1.0980 1.1005 1.1003 1.1022 1.0761
irintensity: 0.6828 0.0333 2.6478 1.4871 11.5025 0.2382 0.0411 0.9970 5.8019 2.4180 4.1930 1.4820 5.2835 37.2637 14.8588 8.3930 15.7748 58.7353 74.8236 123.3458 23.9587 5.4172 44.4460 7.0052 137.7051 6.1551 4.7490 9.9324 65.1577 56.8249 68.4832 18.3455 7.6007 67.9826 14.9115 0.0306 4.3734 4.7583 4.9612 17.4151 25.6706 11.9682 3.8000 13.9383 4.2697 4.4855 15.8406 10.7599 13.1280 16.1113 16.5946 54.4475 11.8293 29.3746 0.7387 12.3025 1.4450 58.0122 25.6082 13.8502 20.1301 35.0839 29.8377
temp: 298.150 k
press: 1.00000 atm
elementType: 16 8 8 8 7 6 6 6 6 6 1 1 1 1 1 1 1 1 1 1 1 1 1
symmnumber: 1
zpe: 482792.9 jmol-1
zpe.correction: 0.183886 hartree
zpe.thermalcorrener: 0.197880 hartree
zpe.thermalcorrenthalpy: 0.198824 hartree
zpe.thermalcorrgfe: 0.141501 hartree
zpe.sumelectzpe: -875.780984 hartree
zpe.sumelectthermal: -875.766991 hartree
zpe.sumelectthermalent: -875.766046 hartree
zpe.sumelectthermalfe: -875.823370 hartree
dipole: 0.7584 4.1059 -1.1811
dipole: 4.3392
quadrupole: -55.3620 -77.4725 -71.8425
quadrupole: -0.5387 -2.0006 -0.0705
quadrupole: 12.8637 -9.2468 -3.6169 -0.5387 -2.0006 -0.0705
hfenergy: -875.9648704 hartree
pointgroup: C01 [X(C5H13N1O3S1)]
dipole: 0.325478 -1.5729308 0.5782562 debye
dipolederiv: 1.9783407 -0.0524293 0.0656923 0.1900616 1.6890024 -0.0519033 0.083694 -0.1376277 1.3349289 -1.2138972 -0.1378475 -0.0452797 -0.2766132 -0.5951835 -0.003684 -0.0283178 0.0348492 -0.4380902 -0.5989697 0.0733221 0.0138965 0.0359765 -0.6741466 -0.0287546 0.0427584 -0.1405077 -0.5197737 -0.5744715 0.0035794 0.0470813 0.0007216 -0.5263265 0.0049978 0.0517883 0.1120309 -0.6341635 -0.5924735 0.0324208 -0.0642389 0.1586036 -0.772183 -0.068411 -0.1767743 -0.0767314 -0.3689716 0.3020988 -0.0487515 -0.0582443 -0.2857766 0.5095294 0.0458086 -0.4352483 0.2060672 0.0840004 -0.0983428 -0.0800156 -0.0079163 -0.0039514 -0.1722395 -0.0197627 0.0644897 -0.0285225 0.1075816 -0.0860749 -0.0156913 -0.025921 0.151222 -0.0370753 -0.0155251 0.1599317 -0.0651801 0.1238647 0.868462 0.1884548 0.0195929 -0.3278408 0.0782829 0.0280829 0.2308208 0.1028374 0.304897 -0.2344644 -0.1743541 0.0198894 0.0749384 0.0405588 0.0218568 -0.0868656 -0.0133545 0.0664275 0.0892748 -0.0049271 -0.0494056 0.0056122 0.0246422 0.05298 0.017536 0.0205989 -0.0291922 0.0934893 0.1123815 0.020236 0.103271 0.2253217 0.1125546 0.1299998 0.024284 0.139656 0.0065549 0.108802 0.0904075 0.118669 -0.0244189 -0.0552734 0.0962424 -0.0854881 0.0180839 0.0902018 0.0054126 -0.037475 -0.0158766 0.0493054 0.0089806 -0.0356507 0.0849209 -0.142564 -0.056935 -0.0742969 -0.0500226 -0.0479185 0.0869354 0.0043251 -0.0606451 0.0151002 0.0714033 0.0926917 -0.0554828 -0.0048871 -0.1028954 -0.100947 0.0263474 -0.0065843 0.0309621 0.0914793 -0.0930609 0.0944587 0.0400122 0.102134 0.0198302 -0.0806556 0.0537658 -0.073003 0.0303946 0.0815987 -0.0175191 0.031993 -0.0036622 0.0834522 0.0672008 -0.0598116 0.0498485 -0.1436566 -0.0597099 -0.0151263 0.0107173 0.1122354 -0.0442607 -0.0726148 0.0308017 -0.0929849 0.0210105 -0.0460682 -0.043758 0.0127709 0.0347519 0.060775 0.0501057 -0.0908392 0.0446881 -0.128619 -0.1844345 -0.0242221 -0.0373347 -0.0593368 0.0518219 0.0173439 -0.0256268 0.0202974 0.1083186 0.1030714 0.1006689 0.0590781 0.0412604 -0.0451007 -0.0756329 0.0518406 -0.0969378 0.0256663 0.1331185 0.0249207 -0.0506422 -0.0055859 0.0724241 0.0316334 -0.0073055 0.0638529 -0.1226817 unknown
polarizability: 134.8708406|1.4979406|96.9221847|-1.1270965|0.4606547|84.0321252 unknown
InChI: InChI=1S/C5H13NO3S/c1-4-9-10(7,8)6-5(2)3/h5-6H,4H2,1-3H3
charge 0 multiplicity 1
23 atoms
S  -0.252268 1.038637 -0.18463
O  -1.304859 -0.492995 0.164007
O  -0.85074 2.249689 0.69559
O  -0.049085 1.180434 -1.778005
N  1.305152 0.526187 0.519844
C  2.153923 -0.437008 -0.242215
C  1.717049 -1.909598 -0.070023
C  3.608471 -0.190459 0.216922
C  -2.747938 -0.288767 -0.138385
C  -3.429967 -1.607599 0.238265
H  2.055897 -0.142132 -1.30342
H  1.183344 0.345664 1.528857
H  2.34054 -2.565927 -0.703614
H  1.837871 -2.235849 0.980579
H  0.65968 -2.041999 -0.356247
H  3.893382 0.862759 0.060878
H  4.293811 -0.837152 -0.360079
H  3.735359 -0.433999 1.288548
H  -3.134282 0.554798 0.464348
H  -2.872372 -0.063927 -1.215067
H  -4.514946 -1.529588 0.038758
H  -3.024305 -2.443634 -0.356189
H  -3.286319 -1.832633 1.308578
