program: Gaussian 09
title: 000153758
version: EM64L-G09RevD.01
frameworkgroup: C1[X(C19H15N3O2S)]
method: RPBEPBE
basis: SDD
operation: Freq
keyword: #p
keyword: freq=noraman
keyword: PBEPBE/SDD
title: #p freq=noraman PBEPBE/SDD
converged: YES YES NO NO
title: Mulliken charges:
elementType: S O O N N N C C C C C C C C C C C C C C C C C C C H H H H H H H H H H H H H H H
charge: 0.910682 -0.544712 -0.515256 -0.500987 -0.023760 -0.708596 0.186621 0.224753 0.263119 -0.104728 -0.096452 0.500082 -0.290386 -0.357504 -0.402702 -0.305747 -0.308429 -0.312926 -0.239015 -0.256946 -0.257243 -0.234192 -0.232302 -0.218233 -0.259306 0.353268 0.268881 0.298582 0.266590 0.266058 0.274441 0.287654 0.233135 0.228353 0.234336 0.233073 0.234451 0.243086 0.322259 0.339996
chargesum: 0.00000
title: Mulliken charges with hydrogens summed into heavy atoms:
elementType: S O O N N N C C C C C C C C C C C C C C C C C C C
charge: 0.910682 -0.544712 -0.515256 -0.147719 -0.023760 -0.046340 0.186621 0.224753 0.263119 -0.104728 -0.096452 0.500082 -0.290386 -0.088623 -0.104119 -0.039157 -0.042371 -0.038485 0.048639 -0.023811 -0.028889 0.000144 0.000771 0.016218 -0.016220
polarizability: 3.30379923e+02 -4.38014133e+00 3.38931476e+02 -7.31577634e+00 1.09503341e+01 1.68705877e+02
1716.lowfreq: -1.3487 -0.0020 -0.0010 -0.0005 5.6267 6.7072 14.0139 26.7771 54.1179
frequency: 13.9863 26.7682 54.1057 60.5864 87.1964 102.3232 117.2086 125.7610 143.9285 170.0332 199.6745 206.6563 235.2341 243.2031 256.7643 276.6938 303.4041 311.7750 327.5078 343.2425 391.7645 402.3034 411.7481 421.6051 434.7973 438.9750 475.6923 491.9469 503.0495 531.7336 537.5418 568.7123 578.3136 589.1846 604.0954 635.1043 646.1745 667.5188 682.1297 706.2219 730.4324 751.0277 759.8857 774.1980 783.3499 786.2162 802.1427 817.3198 827.8911 854.1442 858.5524 862.0578 879.7176 894.2062 918.5032 923.3857 955.0184 972.0389 982.5316 985.7288 988.5053 997.6368 1008.5093 1014.0270 1017.7052 1035.8555 1053.0949 1075.3901 1110.1357 1130.7137 1151.7390 1160.1047 1172.1607 1180.9380 1224.0398 1242.6750 1251.9061 1284.8412 1292.1480 1323.6479 1359.6053 1367.5753 1368.8690 1392.6947 1426.7073 1431.0844 1442.0255 1457.8086 1471.3579 1483.1755 1518.4781 1524.5606 1537.4339 1548.1578 1550.4414 1580.1744 1610.4680 1619.8741 1633.4047 3123.0975 3133.6046 3136.5881 3139.3217 3146.0873 3146.6041 3153.4816 3162.0639 3168.9159 3170.8686 3172.7951 3178.6981 3276.4286 3347.0755 3510.7215
redmass: 5.7889 6.4975 5.7214 6.4108 5.0788 3.9918 4.4854 5.3881 3.2008 5.0670 9.3533 2.2356 4.7367 4.8973 7.2119 3.5173 4.4459 4.1252 4.1772 6.1438 6.6241 4.9465 5.2415 7.3714 4.4825 4.5481 3.0086 4.7382 3.2517 5.3128 3.5255 6.4391 5.4319 4.1329 5.8435 6.2309 6.0571 4.2442 1.5967 4.3629 3.0010 3.2979 1.2633 1.6594 2.0238 2.5690 3.5273 1.5135 3.9465 1.4975 6.1063 4.5017 1.6448 1.6977 6.6352 6.8135 1.3352 1.3519 4.3122 1.4212 1.4174 1.3271 1.3193 2.2245 2.0644 1.9183 1.3561 4.3340 1.9851 1.5978 1.3347 1.1728 1.0761 1.1779 1.4580 1.6901 2.6614 1.7018 5.0247 2.2587 2.5145 2.2015 3.7557 2.7958 6.4301 2.9314 2.8320 3.3036 2.8066 3.0278 2.5147 6.6246 1.1006 6.7984 7.5601 2.5424 5.9585 5.6756 6.3789 1.0881 1.0856 1.0899 1.0867 1.0903 1.0893 1.0951 1.0958 1.0932 1.0990 1.1000 1.0996 1.0791 1.0418 1.0991
irintensity: 1.5615 0.5123 1.0037 1.5414 1.8476 4.4541 1.6110 4.5271 8.2965 1.4142 0.2367 8.9238 0.5421 4.4330 5.6589 6.7303 12.4469 6.2429 7.4634 1.7495 2.5102 18.1809 4.8452 41.1859 2.4813 16.5955 4.3439 99.3506 0.1377 15.7691 5.9450 9.9937 7.0324 6.3797 5.1696 8.2053 3.4435 12.5033 31.0711 8.9620 27.2234 2.7103 94.4632 58.9562 14.8701 178.4302 0.6877 72.5642 1.4724 1.0488 7.9796 1.0406 1.9527 1.1636 146.9127 3.6828 1.4157 0.9198 22.0275 2.6695 1.9990 0.3296 0.6505 4.6241 10.2408 19.1234 7.1903 6.6731 0.1547 5.4415 6.4971 1.6483 1.7934 6.2667 0.6601 3.9656 2.5230 1.4330 0.9875 22.6019 5.9794 9.7419 117.2260 1.8349 132.2813 1.6847 23.2867 0.2083 151.4496 23.6398 123.4188 32.9347 40.6715 8.0865 28.1529 39.4176 11.0850 257.2680 4.1666 5.2388 3.3215 3.5635 7.4921 4.7562 5.7039 18.7496 16.6746 5.3133 33.4946 24.9774 12.4315 263.5589 17.8505 18.0092
temp: 298.150 k
press: 1.00000 atm
elementType: 16 8 8 7 7 7 6 6 6 6 6 6 6 6 6 6 6 6 6 6 6 6 6 6 6 1 1 1 1 1 1 1 1 1 1 1 1 1 1 1
symmnumber: 1
zpe: 780258.5 jmol-1
zpe.correction: 0.297185 hartree
zpe.thermalcorrener: 0.318278 hartree
zpe.thermalcorrenthalpy: 0.319222 hartree
zpe.thermalcorrgfe: 0.246425 hartree
zpe.sumelectzpe: -1443.900626 hartree
zpe.sumelectthermal: -1443.879533 hartree
zpe.sumelectthermalent: -1443.878588 hartree
zpe.sumelectthermalfe: -1443.951386 hartree
dipole: -0.1829 0.5256 3.7188
dipole: 3.7602
quadrupole: -161.0462 -125.9327 -159.7781
quadrupole: -9.3915 -14.4635 -0.5166
quadrupole: -12.1272 22.9863 -10.8591 -9.3915 -14.4635 -0.5166
hfenergy: -1444.1978103 hartree
pointgroup: C01 [X(C19H15N3O2S1)]
dipole: 0.1278751 -0.6784038 1.3084074 debye
polarizability: 329.6116653|-2.6619524|328.7294243|-4.1539673|43.7792465|179.6761868 unknown
InChI: InChI=1S/C19H15N3O2S/c20-25(23,24)18-12-6-5-11-17(18)22-19-13-7-1-3-9-15(13)21-16-10-4-2-8-14(16)19/h1-12,22H,20H2
charge 0 multiplicity 1
40 atoms
S  3.562174 -0.623489 -1.519665
O  2.513682 -0.154455 -2.694493
O  5.164908 -0.447056 -1.721461
N  0.68211 0.07879 -0.538791
N  -3.565546 -0.150255 0.186875
N  3.086274 -2.401122 -1.292702
C  -0.725735 0.02034 -0.270054
C  -1.482328 1.202486 -0.025858
C  -1.380821 -1.245088 -0.300274
C  -2.917127 1.056783 0.215693
C  -2.825225 -1.273624 -0.074875
C  1.669414 0.294838 0.414904
C  3.055586 0.097493 0.12495
C  -0.907076 2.521733 -0.030459
C  -0.681596 -2.48305 -0.529383
C  -3.698521 2.236636 0.4811
C  -3.508415 -2.539539 -0.117044
C  1.381431 0.72034 1.751359
C  4.100996 0.369598 1.025859
C  -1.698601 3.638256 0.220198
C  -1.380876 -3.686514 -0.557671
C  -3.105328 3.494856 0.487299
C  -2.805363 -3.715819 -0.356814
C  2.413451 0.97319 2.670409
C  3.779965 0.824385 2.319151
H  1.005514 -0.119963 -1.503044
H  0.160357 2.631657 -0.246203
H  0.405612 -2.465049 -0.670152
H  -4.767645 2.095432 0.666217
H  -4.589974 -2.529899 0.048209
H  0.337896 0.855963 2.047597
H  5.138071 0.224985 0.703714
H  -1.25245 4.638616 0.208436
H  -0.844388 -4.62626 -0.729371
H  -3.708895 4.387196 0.686065
H  -3.333426 -4.675265 -0.387826
H  2.148464 1.304429 3.680575
H  4.572354 1.04615 3.039256
H  3.799213 -2.879029 -0.714409
H  3.004264 -2.816878 -2.237816
