program: Gaussian 09
title: 000153703
version: EM64L-G09RevD.01
frameworkgroup: C1[X(C15H11ClN4O2)]
method: RPBEPBE
basis: SDD
operation: Freq
keyword: #p
keyword: freq=noraman
keyword: PBEPBE/SDD
title: #p freq=noraman PBEPBE/SDD
converged: YES YES NO NO
title: Mulliken charges:
elementType: Cl O O N N N N C C C C C C C C C C C C C C C H H H H H H H H H H H
charge: -0.072936 -0.244363 -0.429598 -0.051576 -0.619204 -0.030707 -0.038627 -0.566314 0.399666 -0.266033 0.225432 -0.355655 0.282635 -0.287160 -0.243736 0.097413 -0.254842 0.209715 0.087467 -0.434287 -0.277001 -0.221334 0.236796 0.237861 0.244429 0.267323 0.258387 0.242931 0.256377 0.276602 0.363827 0.346211 0.360301
chargesum: 0.00000
title: Mulliken charges with hydrogens summed into heavy atoms:
elementType: Cl O O N N N N C C C C C C C C C C C C C C C
charge: -0.072936 -0.244363 -0.065771 -0.051576 0.087308 -0.030707 -0.038627 -0.091657 0.399666 0.245719 0.225432 -0.097269 0.282635 -0.287160 -0.000805 0.097413 0.001535 0.209715 0.087467 -0.157685 -0.277001 -0.221334
polarizability: 2.18416826e+02 1.55711556e+01 2.56714203e+02 4.12301531e+00 -4.57928905e+00 1.41161636e+02
1716.lowfreq: -8.3550 -3.5153 -0.0013 -0.0011 0.0007 4.3367 12.4103 20.4848 25.2408
frequency: 12.2804 20.4185 25.2047 45.9449 82.1084 91.9319 101.0462 117.4089 135.0123 160.6290 177.3832 198.1391 224.6517 237.4208 254.8453 260.9291 324.0507 327.8292 365.1582 374.2075 408.9117 430.1150 436.4764 461.2104 466.5710 467.4444 498.5212 514.5807 518.3548 525.0688 535.0209 559.1198 570.8508 599.3142 604.6080 616.9361 627.3238 676.4062 719.8962 728.6060 773.7749 785.5151 790.7564 818.6934 856.0097 905.2866 939.9057 946.2699 950.6149 971.4087 985.2021 990.1090 1046.2528 1079.8550 1107.4048 1109.6228 1167.5238 1178.3488 1220.8764 1224.0093 1224.9809 1234.7975 1278.3616 1309.1326 1318.8111 1341.7478 1345.5785 1356.5797 1390.9195 1431.9909 1434.5209 1451.6656 1467.1017 1472.5224 1479.5632 1512.5973 1572.9224 1583.8586 1612.6203 1623.3558 2148.8298 2177.6532 3009.7297 3017.0930 3075.8274 3094.4433 3148.7866 3152.7228 3162.9143 3180.5753 3496.2261 3531.1512 3681.7409
redmass: 9.5197 8.4337 6.8237 8.8202 7.9317 9.2944 6.3343 8.5408 10.5054 6.3352 3.2007 4.8913 8.2277 5.5386 9.1788 5.9312 5.0688 2.6906 6.2847 5.0237 5.4703 4.4650 6.1120 3.7584 1.1970 5.3421 6.2735 5.5250 1.2273 5.5481 3.9886 1.6008 5.2046 2.6492 6.6247 5.2844 5.1528 8.9874 6.1985 3.7351 1.3714 10.1089 5.2544 4.2785 3.7807 1.3823 1.4556 6.0437 2.7051 1.4059 2.1376 2.3658 2.3372 1.9742 2.9257 3.3236 1.1684 1.1294 1.9624 3.3598 2.5346 1.3583 2.2059 1.4873 4.5575 1.4325 1.4519 3.2349 5.9103 2.6372 2.8806 1.2528 1.2905 2.5027 3.4262 6.0908 5.2881 6.8218 7.1706 1.4365 12.5955 12.6215 1.0563 1.0604 1.1029 1.1089 1.0877 1.0932 1.0924 1.0994 1.0648 1.0450 1.1053
irintensity: 0.6134 0.5975 1.6551 4.3102 1.3219 0.3464 1.4935 0.6672 7.8168 3.4651 2.9267 0.3800 1.7832 2.5209 7.3059 5.1558 7.2887 4.0557 9.6141 3.3121 2.6310 7.2891 2.8018 4.0602 128.3842 3.9812 4.6339 7.0404 95.1464 6.7724 1.6859 127.6058 5.1622 58.9616 10.5228 1.3892 2.6220 2.6431 1.4337 25.7124 60.7599 12.5211 19.5107 39.5397 7.2941 2.6695 11.2735 28.2529 14.3276 6.8004 10.1325 51.2437 14.4624 22.6262 44.1075 81.3686 56.1628 14.3233 46.7903 80.6154 39.0479 3.0099 58.9866 18.3566 2.0438 49.8377 40.7597 17.1251 10.9783 50.9305 124.9748 19.2194 15.8289 32.2817 92.4876 183.4323 231.3703 5.4373 7.4972 459.4780 68.9378 62.4042 11.0919 22.1203 3.4346 20.1135 2.9455 4.8921 3.4833 5.1539 58.6900 147.6038 53.6754
temp: 298.150 k
press: 1.00000 atm
elementType: 17 8 8 7 7 7 7 6 6 6 6 6 6 6 6 6 6 6 6 6 6 6 1 1 1 1 1 1 1 1 1 1 1
symmnumber: 1
zpe: 614107.1 jmol-1
zpe.correction: 0.233901 hartree
zpe.thermalcorrener: 0.254117 hartree
zpe.thermalcorrenthalpy: 0.255061 hartree
zpe.thermalcorrgfe: 0.182122 hartree
zpe.sumelectzpe: -1406.145768 hartree
zpe.sumelectthermal: -1406.125552 hartree
zpe.sumelectthermalent: -1406.124608 hartree
zpe.sumelectthermalfe: -1406.197546 hartree
dipole: -1.4443 -2.3173 -0.7412
dipole: 2.8293
quadrupole: -118.7020 -147.4830 -130.7174
quadrupole: 7.8626 4.8656 1.5374
quadrupole: 13.5988 -15.1822 1.5834 7.8626 4.8656 1.5374
hfenergy: -1406.3796688 hartree
pointgroup: C01 [X(C15H11Cl1N4O2)]
dipole: 0.3681489 0.8676247 0.5922804 debye
polarizability: 213.7899004|7.6979772|186.5140141|1.9928832|58.4138649|215.988751 unknown
InChI: InChI=1S/C15H11ClN4O2/c16-12-3-1-2-9(13(12)21)4-5-22-14-10(6-17)8-20-15(19)11(14)7-18/h1-3,8,21H,4-5,19H2
charge 0 multiplicity 1
33 atoms
Cl -5.319421 1.437568 -0.921214
O  0.623948 -0.798285 0.484865
O  -3.500389 0.492998 1.348064
N  4.124095 1.339056 -0.555516
N  3.996073 2.729997 1.302287
N  1.317622 1.969449 3.303119
N  1.574043 -2.353789 -2.481301
C  -1.513865 -1.498263 1.348468
C  -2.302747 -1.183325 0.089584
C  -0.3500 -0.52555 1.584593
C  -3.298864 -0.170217 0.131243
C  -2.064943 -1.845753 -1.13661
C  1.737677 -0.040628 0.243273
C  -4.033478 0.127238 -1.039815
C  -2.804371 -1.531129 -2.299785
C  2.246811 1.026793 1.038855
C  -3.80726 -0.535503 -2.256287
C  2.4475 -0.40607 -0.949688
C  3.45564 1.693968 0.587298
C  3.620627 0.316708 -1.285319
C  1.680329 1.489877 2.265007
C  1.969378 -1.468726 -1.779179
H  -1.110362 -2.524956 1.299368
H  -2.171122 -1.429678 2.234674
H  0.144974 -0.716101 2.553474
H  -0.685473 0.524511 1.531284
H  -1.277717 -2.605374 -1.183731
H  -2.598452 -2.052566 -3.239038
H  -4.393034 -0.278507 -3.143297
H  4.173832 0.05268 -2.192443
H  -4.237001 1.154742 1.256685
H  4.846005 3.159052 0.94037
H  3.574748 3.068784 2.165411
