program: Gaussian 09
title: 000153701
version: EM64L-G09RevD.01
frameworkgroup: C1[X(C18H18O4S)]
method: RPBEPBE
basis: SDD
operation: Freq
keyword: #p
keyword: freq=noraman
keyword: PBEPBE/SDD
title: #p freq=noraman PBEPBE/SDD
converged: YES YES NO NO
title: Mulliken charges:
elementType: S O O O O C C C C C C C C C C C C C C C C C C H H H H H H H H H H H H H H H H H H
charge: 0.224125 -0.318171 -0.251480 -0.400140 -0.367678 0.023578 0.236847 0.183142 -0.529691 0.394284 0.151523 -0.540869 0.491052 -0.308157 -0.303809 -0.405901 -0.384357 -0.227615 -0.163658 -0.238687 -0.521920 -0.535197 -0.863731 0.264427 0.279862 0.287108 0.274846 0.238117 0.241443 0.239731 0.245251 0.383146 0.227713 0.238774 0.232725 0.228192 0.250151 0.222520 0.269234 0.266979 0.266292
chargesum: 0.00000
title: Mulliken charges with hydrogens summed into heavy atoms:
elementType: S O O O O C C C C C C C C C C C C C C C C C C
charge: 0.224125 -0.318171 -0.251480 -0.016994 -0.367678 0.023578 0.236847 0.183142 -0.265264 0.394284 0.151523 -0.261006 0.491052 -0.021049 -0.028963 -0.167784 -0.142915 -0.227615 0.076073 0.006564 0.177292 0.165666 -0.061226
polarizability: 5.71863539e+02 -5.06646643e+00 2.49833728e+02 9.36807519e+00 6.44933850e+00 1.12474875e+02
1716.lowfreq: -5.1992 -1.7244 -0.0011 -0.0007 0.0015 1.2716 20.1254 25.4256 30.9124
frequency: 20.0638 25.3432 30.8894 46.8020 55.1895 72.2237 82.0692 114.4298 127.5701 134.2033 146.9899 161.9092 167.3858 184.2192 199.3301 217.4959 224.8070 228.2517 242.4592 282.1601 306.0645 330.9452 338.0533 349.2705 357.1102 386.6381 408.5082 410.7104 447.4306 495.3419 501.1645 508.2123 552.1102 565.3282 614.4525 628.3259 639.2324 642.6339 651.9948 669.9974 674.7729 725.4876 757.7742 781.8699 827.4874 831.8878 835.9902 861.8120 872.2809 882.7060 913.7647 932.5748 958.5011 966.7647 971.5988 987.4925 1003.3452 1007.7447 1015.0168 1016.6777 1026.4025 1044.3706 1077.9164 1110.2029 1110.6292 1125.6195 1141.6117 1148.1122 1161.4340 1197.1011 1198.9251 1227.8018 1237.5934 1260.3375 1292.7228 1309.6841 1317.1138 1349.0991 1352.9184 1376.1169 1387.1981 1413.9929 1420.9608 1430.5742 1438.5893 1454.6415 1455.6546 1460.7623 1461.8340 1468.3328 1469.0841 1471.8325 1486.1759 1530.2455 1554.0996 1576.2742 1602.6944 1624.0903 1640.5898 2483.1545 2965.9175 2968.2156 3010.0546 3059.5610 3060.0601 3103.2561 3118.3836 3127.9805 3128.4633 3131.0281 3135.5681 3137.8611 3150.4818 3162.1489 3165.6967 3180.8093 3193.8310
redmass: 5.7416 3.6671 5.3899 4.1514 4.3901 3.4011 3.9074 4.3801 5.4801 3.8482 1.1119 5.6143 4.8077 2.9550 3.0125 1.5040 1.2342 3.4686 3.4345 3.6323 5.6999 5.7828 4.5253 4.6496 5.2251 6.6555 2.8892 5.4380 7.3204 5.1153 2.7885 5.7138 7.0920 6.6011 4.6961 6.9344 5.1878 4.1159 5.1991 3.3628 7.5470 3.4469 3.7835 6.9423 1.4154 1.3943 1.6379 1.8358 5.2432 5.3898 1.8594 8.4158 1.3470 1.1986 1.3669 1.4096 2.7260 3.9042 1.1068 1.1858 3.6313 4.9766 3.5446 1.2438 1.2565 1.4436 1.8028 1.3772 1.7361 1.2550 1.3917 1.4931 2.5060 3.0367 1.6629 1.6809 2.3163 1.2076 2.9419 3.0150 6.8880 2.7850 3.5502 1.6522 1.3168 1.0525 1.7638 1.2336 1.0813 1.0546 1.0517 1.0657 2.3071 4.9458 6.1169 2.5251 5.6949 5.3378 5.0361 1.0763 1.0307 1.0326 1.0291 1.1045 1.1043 1.0897 1.1016 1.0876 1.1063 1.1001 1.0937 1.0961 1.0968 1.0948 1.0915 1.0912 1.0928
irintensity: 0.1007 0.2608 0.2728 0.3050 4.3261 2.0847 1.2771 1.9578 2.3198 3.0774 0.1513 0.0689 0.0422 0.4571 1.8853 1.5275 1.8265 7.3563 1.8019 0.4791 15.0457 1.3150 1.4114 1.0049 0.4020 6.5121 0.8397 41.6106 12.6809 2.3704 24.6535 24.0943 1.3907 34.2163 1.6426 0.2629 25.0518 1.1170 25.3975 2.7839 3.0464 0.6402 13.1945 30.8429 24.0626 21.4937 10.1590 53.4334 14.2613 12.1069 1.7177 12.3026 0.2678 9.7551 1.1570 9.9213 14.4813 80.0321 66.9642 104.0693 93.8514 54.8522 154.2957 0.2986 0.3525 6.6124 192.5476 4.6177 125.4420 128.0672 32.9372 21.7064 346.2310 92.8914 50.9070 155.4081 133.1155 6.9407 57.7585 164.9029 146.5888 44.6100 2.6040 92.0936 80.8566 16.5621 134.9509 78.8076 70.1396 26.8639 17.9211 65.8911 173.0685 438.6424 19.7172 153.1351 418.4509 388.0074 668.5276 526.7584 49.1803 75.9919 25.6319 33.4183 46.3071 1.1035 19.3237 6.1247 16.2518 27.2242 14.3120 0.0963 17.1373 6.8250 24.1319 1.9557 0.6353
temp: 298.150 k
press: 1.00000 atm
elementType: 16 8 8 8 8 6 6 6 6 6 6 6 6 6 6 6 6 6 6 6 6 6 6 1 1 1 1 1 1 1 1 1 1 1 1 1 1 1 1 1 1
symmnumber: 1
zpe: 825953.7 jmol-1
zpe.correction: 0.314589 hartree
zpe.thermalcorrener: 0.337518 hartree
zpe.thermalcorrenthalpy: 0.338462 hartree
zpe.thermalcorrgfe: 0.260086 hartree
zpe.sumelectzpe: -1393.973431 hartree
zpe.sumelectthermal: -1393.950502 hartree
zpe.sumelectthermalent: -1393.949558 hartree
zpe.sumelectthermalfe: -1394.027934 hartree
dipole: 2.7831 -7.1213 1.4658
dipole: 7.7851
quadrupole: -128.8780 -133.6539 -143.4934
quadrupole: 14.4349 -4.8766 1.2880
quadrupole: 6.4637 1.6879 -8.1516 14.4349 -4.8766 1.2880
hfenergy: -1394.2880202 hartree
pointgroup: C01 [X(C18H18O4S1)]
dipole: 0.8817519 -2.3823923 1.7111501 debye
polarizability: 566.7018288|-7.1101711|233.7059609|46.7877519|-46.1725408|133.7643526 unknown
InChI: InChI=1S/C18H18O4S/c1-21-13-10-16(20)18(17(11-13)22-2)15(19)9-6-12-4-7-14(23-3)8-5-12/h4-11,20H,1-3H3
charge 0 multiplicity 1
41 atoms
S  7.178947 -0.728559 0.667499
O  -1.553007 -1.201176 1.017814
O  -6.158626 -1.06616 -0.580591
O  -3.323466 2.608303 -1.598218
O  -0.938694 2.615504 -0.986498
C  -2.300361 0.738797 -0.370361
C  -2.559354 -0.513429 0.281603
C  -3.445989 1.377378 -1.011494
C  -3.811489 -1.141798 0.237155
C  -4.882282 -0.514154 -0.462941
C  -0.985988 1.395854 -0.504795
C  -4.705539 0.744687 -1.064608
C  2.804674 0.797529 -0.04182
C  0.272335 0.702755 -0.190827
C  1.476506 1.359748 -0.281399
C  3.031885 -0.57125 0.288696
C  3.94655 1.648482 -0.145119
C  5.45107 -0.202174 0.403531
C  4.329186 -1.065764 0.50812
C  5.246536 1.164597 0.072901
C  -1.333887 -0.6658 2.379775
C  -6.397704 -2.386207 0.014283
C  7.004901 -2.560029 1.036808
H  -3.923996 -2.097546 0.753894
H  -5.534805 1.23927 -1.57402
H  0.197126 -0.351093 0.088368
H  1.432781 2.421249 -0.566014
H  2.18432 -1.260746 0.368691
H  3.802857 2.704838 -0.401921
H  4.459009 -2.123384 0.756842
H  6.103917 1.841081 -0.014385
H  -2.322454 2.908964 -1.441203
H  -2.274921 -0.701052 2.960763
H  -0.954985 0.373219 2.34536
H  -0.581401 -1.324284 2.840068
H  -5.727591 -3.149767 -0.423986
H  -7.443095 -2.622653 -0.230843
H  -6.268948 -2.360292 1.113244
H  6.553926 -3.088259 0.18257
H  6.417583 -2.719829 1.954241
H  8.032772 -2.922251 1.191216
