program: Gaussian 09
title: 000153699
version: EM64L-G09RevD.01
frameworkgroup: C1[X(C14H11Cl2NO4)]
method: RPBEPBE
basis: SDD
operation: Freq
keyword: #p
keyword: freq=noraman
keyword: PBEPBE/SDD
title: #p freq=noraman PBEPBE/SDD
converged: YES YES NO NO
title: Mulliken charges:
elementType: Cl Cl O O O O N C C C C C C C C C C C C C C H H H H H H H H H H H
charge: -0.013649 -0.050370 -0.283053 -0.285606 -0.398198 -0.311624 -0.372619 0.115786 0.347352 0.278745 -0.457164 -0.368705 -0.348992 0.471398 0.205622 -0.306397 -0.311273 -0.196130 -0.213399 -0.109185 -0.496029 0.306843 0.263329 0.264991 0.274303 0.360564 0.281329 0.258706 0.244202 0.236188 0.243690 0.369344
chargesum: 0.00000
title: Mulliken charges with hydrogens summed into heavy atoms:
elementType: Cl Cl O O O O N C C C C C C C C C C C C C C
charge: -0.013649 -0.050370 -0.283053 -0.285606 -0.028854 -0.311624 -0.012055 0.115786 0.347352 0.278745 -0.150321 -0.105376 -0.084000 0.471398 0.205622 -0.306397 -0.036970 0.085199 0.045307 -0.109185 0.228051
polarizability: 2.88892715e+02 -2.12527070e+01 2.03916509e+02 -1.88866304e+01 -3.23291438e+00 1.33472861e+02
1716.lowfreq: -3.8175 -3.4231 0.0012 0.0013 0.0018 3.4060 10.5867 22.1932 36.0290
frequency: 10.3285 22.1876 36.0263 64.4981 92.3702 95.0684 99.2570 123.5504 144.1095 148.5615 164.6503 170.3133 194.5202 197.0005 231.4649 284.1022 304.7125 312.4949 333.2311 349.3849 364.0834 373.2730 389.2244 410.5075 435.2908 438.6918 445.4659 522.1162 539.8242 558.2785 609.9035 631.4680 655.5107 674.4616 682.9880 707.3525 712.0792 743.0364 752.7670 805.2155 809.9370 834.8423 844.8079 861.3544 885.8204 918.8269 945.0587 950.0182 965.1805 974.4208 1028.6491 1054.5213 1081.4513 1114.5152 1129.9259 1143.1187 1149.9501 1161.8921 1218.7374 1232.0733 1247.0846 1265.5564 1283.7226 1336.0548 1356.9798 1374.9771 1385.8255 1398.7083 1421.4697 1431.7966 1452.3788 1454.8336 1463.5729 1487.6850 1568.9347 1575.5289 1577.3217 1593.5054 1631.3341 3007.2288 3110.2210 3151.5628 3159.9917 3163.2031 3177.2477 3179.6167 3183.9150 3190.9863 3351.4052 3500.3543
redmass: 8.1487 7.8152 9.6027 4.4280 2.9847 1.7304 4.8992 3.0567 11.2833 5.7255 5.8170 6.1166 9.0844 6.9708 7.4007 5.4279 2.4211 3.7335 3.1250 3.2038 7.8402 7.9966 8.0676 8.0726 4.5426 4.3495 4.1185 4.5408 4.4261 5.0049 5.0022 6.6847 6.2526 4.6835 4.8802 2.4089 5.3731 6.0136 5.9228 3.6911 1.4997 1.5739 2.7678 1.3865 7.6859 1.4261 1.3434 4.8029 1.3659 4.1571 4.0689 3.4973 2.4804 1.2594 1.3643 1.3270 1.4785 2.5843 1.9949 3.0196 1.4636 1.8298 1.7011 1.5466 4.8774 2.6397 5.5078 2.5832 4.1521 1.4444 1.0521 2.6397 1.0535 3.1578 8.4034 6.6643 5.0031 7.3650 6.9311 1.0294 1.1047 1.1049 1.0883 1.0898 1.0922 1.0963 1.0938 1.0952 1.0806 1.0685
irintensity: 0.2179 0.2758 0.0326 2.4685 0.4878 1.7746 0.8764 1.9180 1.0401 0.3011 0.4391 4.3937 1.3748 0.1894 7.2354 23.9603 64.2735 20.4579 19.7592 24.7964 10.7170 0.8342 10.5734 1.7726 11.7248 2.2430 2.6946 15.9000 14.7010 12.3310 16.5547 6.9771 28.0650 71.0997 16.3581 135.4973 27.7434 21.0425 30.9071 41.8894 54.8747 31.8037 28.4701 20.7275 13.8046 11.5916 0.3801 57.8067 1.6540 86.1339 95.9622 80.9949 57.7159 0.1138 4.5266 0.8054 57.2906 82.7378 83.0296 364.0671 83.8448 201.4391 52.6229 91.5657 24.7005 23.0130 8.1556 37.4487 1.7347 41.5272 10.6679 390.8570 16.0923 279.4792 78.5557 69.5713 72.6147 5.5181 59.7009 39.1840 23.5570 13.0583 2.7544 2.2269 4.3473 0.6112 0.6396 2.5398 104.0272 32.0402
temp: 298.150 k
press: 1.00000 atm
elementType: 17 17 8 8 8 8 7 6 6 6 6 6 6 6 6 6 6 6 6 6 6 1 1 1 1 1 1 1 1 1 1 1
symmnumber: 1
zpe: 583882.2 jmol-1
zpe.correction: 0.222389 hartree
zpe.thermalcorrener: 0.242582 hartree
zpe.thermalcorrenthalpy: 0.243526 hartree
zpe.thermalcorrgfe: 0.170556 hartree
zpe.sumelectzpe: -1814.292710 hartree
zpe.sumelectthermal: -1814.272517 hartree
zpe.sumelectthermalent: -1814.271573 hartree
zpe.sumelectthermalfe: -1814.344543 hartree
dipole: 2.5746 1.6866 -2.0068
dipole: 3.6743
quadrupole: -139.6639 -126.6584 -128.7597
quadrupole: 0.2874 -9.6111 9.6577
quadrupole: -7.9699 5.0356 2.9343 0.2874 -9.6111 9.6577
hfenergy: -1814.5150991 hartree
pointgroup: C01 [X(C14H11Cl2N1O4)]
dipole: 0.9544006 0.4465865 -0.989619 debye
polarizability: 291.556331|-19.7455776|191.2795416|-13.5582285|-24.2530028|143.4462119 unknown
InChI: InChI=1S/C14H11Cl2NO4/c1-20-14(18)10-7-9(3-4-12(10)17-19)21-13-5-2-8(15)6-11(13)16/h2-7,17,19H,1H3
charge 0 multiplicity 1
32 atoms
Cl -3.341774 -1.72243 2.630289
Cl -6.081822 0.912198 -1.419243
O  -1.020376 -1.528036 0.784234
O  1.55963 2.764699 0.159159
O  5.260713 -1.461112 -0.558896
O  3.756914 2.189266 -0.335234
N  4.299276 -0.382367 -0.752148
C  2.080685 0.437917 -0.068068
C  0.291532 -1.176681 0.34942
C  2.99679 -0.646932 -0.329215
C  0.729471 0.150832 0.269861
C  1.190784 -2.248679 0.132653
C  2.526739 -1.987931 -0.199995
C  -2.147763 -0.897812 0.237512
C  2.559013 1.831516 -0.104293
C  -3.345301 -0.946917 0.994393
C  -2.172702 -0.294501 -1.04366
C  -4.545799 -0.403676 0.499845
C  -3.365993 0.258116 -1.554593
C  -4.535635 0.197038 -0.773816
C  1.988774 4.18289 0.162438
H  0.056779 0.985788 0.482005
H  0.827392 -3.275105 0.239955
H  3.234093 -2.806677 -0.346831
H  -1.259001 -0.264237 -1.643896
H  4.679778 0.558055 -0.548039
H  -5.458867 -0.447571 1.098191
H  -3.381023 0.71979 -2.545421
H  2.729269 4.354932 0.961238
H  1.066829 4.751248 0.347643
H  2.435286 4.449967 -0.809776
H  5.542611 -1.70319 -1.482213
