program: Gaussian 09
title: 000153644
version: EM64L-G09RevD.01
frameworkgroup: C1[X(C29H24N4S)]
method: RPBEPBE
basis: SDD
operation: Freq
keyword: #p
keyword: freq=noraman
keyword: PBEPBE/SDD
title: #p freq=noraman PBEPBE/SDD
converged: YES YES NO NO
title: Mulliken charges:
elementType: S N N N N C C C C C C C C C C C C C C C C C C C C C C C C C C C C C H H H H H H H H H H H H H H H H H H H H H H H H
charge: 0.148768 -0.412177 -0.100263 -0.064323 -0.675347 0.302896 -0.291130 0.336939 0.571979 0.233295 0.216941 -0.330209 0.260811 -0.878876 0.299086 -0.739148 -0.095837 -0.093291 -0.063770 -0.392643 -0.439417 -0.277541 -0.297160 -0.342234 -0.344719 -0.324568 -0.322391 -0.309239 -0.308963 -0.275947 -0.236172 -0.254499 -0.282086 -0.234046 0.253674 0.210914 0.281112 0.267508 0.353378 0.262782 0.288949 0.193839 0.243001 0.230487 0.223672 0.236258 0.190992 0.261921 0.260365 0.246021 0.221134 0.219820 0.328380 0.327271 0.225931 0.222331 0.231577 0.233963
chargesum: 0.00000
title: Mulliken charges with hydrogens summed into heavy atoms:
elementType: S N N N N C C C C C C C C C C C C C C C C C C C C C C C C C C C C C
charge: 0.148768 -0.058799 -0.100263 -0.064323 -0.019695 0.302896 -0.291130 0.336939 0.571979 0.233295 0.216941 0.134379 0.260811 -0.330256 0.299086 -0.187418 -0.095837 -0.093291 -0.063770 -0.198804 -0.196416 -0.047055 -0.073488 -0.105975 -0.153727 -0.062647 -0.062026 -0.063218 -0.087829 -0.056127 -0.010241 -0.032168 -0.050509 -0.000083
polarizability: 4.52849749e+02 2.08845516e+01 3.80990495e+02 1.04288595e+02 1.84505966e+01 3.29218811e+02
1716.lowfreq: -9.7042 -5.4317 -0.0008 0.0010 0.0014 2.1724 9.6338 13.9850 21.4096
frequency: 8.2382 13.7160 20.9089 38.9383 40.8689 50.3690 65.5722 76.4216 97.3613 106.5122 107.8848 123.2280 137.7844 163.1692 198.0473 211.4041 226.7631 237.0284 251.0030 263.7144 270.0836 310.3410 318.0721 321.6944 327.8183 352.2534 373.3959 383.9141 393.4563 407.1852 413.5023 434.6967 440.8101 449.1328 462.4602 466.8207 505.0132 510.4765 518.9741 527.8625 539.4337 560.4669 569.2832 572.2093 579.6136 580.6207 598.3197 619.8286 627.1823 634.7837 636.4725 643.9156 650.7196 671.3272 682.8257 689.1900 743.1066 748.5836 755.0983 760.3897 762.0684 769.5778 790.3966 796.7496 815.1241 825.8519 835.8277 858.7335 860.7828 862.7226 865.4452 867.1412 872.0080 894.3874 907.2476 917.8646 947.5667 950.4159 952.6130 966.6844 974.7894 985.7849 987.8248 990.3831 992.6130 1023.9641 1025.8656 1028.4456 1046.5672 1055.3175 1078.3238 1107.5465 1110.7959 1121.6299 1131.2333 1157.8169 1157.8609 1166.9263 1167.9608 1191.0729 1192.9126 1202.0513 1208.3134 1224.4763 1231.3277 1239.0552 1242.3612 1250.7317 1254.0529 1277.6493 1283.1704 1290.4355 1303.7515 1311.6072 1341.6352 1357.6486 1360.3104 1380.0907 1384.3090 1404.6517 1409.4320 1429.0787 1435.7819 1441.7329 1443.9440 1444.5338 1449.2825 1457.6461 1460.2840 1473.8113 1483.5414 1494.0066 1506.9308 1528.3749 1529.5058 1553.0143 1555.7036 1561.4957 1566.4313 1611.3957 1611.9538 1626.5937 1628.3974 1653.6337 2937.1113 3005.8604 3017.1697 3041.4099 3094.0489 3111.3441 3111.8797 3116.9379 3119.4170 3126.5241 3129.0557 3131.7354 3137.5885 3144.8024 3148.7536 3154.3488 3160.1709 3164.7872 3166.0082 3169.4873 3200.7283 3468.7142 3575.6439 3707.3742
redmass: 5.9392 5.9533 5.8708 5.0617 5.9081 5.2546 4.8579 4.4234 5.0103 4.0412 4.7397 6.3575 4.3422 4.1708 3.5036 3.7909 3.6354 3.7136 3.8871 3.9371 3.5525 5.5424 4.2054 3.2889 3.9963 3.3499 1.3804 4.4069 5.6785 4.9428 3.4615 5.2872 3.8232 3.0191 1.3761 2.4651 3.6830 3.3601 3.3856 6.0281 2.8535 2.3009 4.4672 4.3921 3.6381 3.3926 5.6175 6.0191 4.3543 5.0456 4.3385 4.7026 4.4016 6.8153 4.2423 4.9369 3.5057 1.7873 1.5921 1.4416 1.4148 2.1662 3.7705 2.6438 2.9531 2.8107 4.5992 2.0690 1.8837 2.1679 2.7256 2.4340 2.6182 4.1248 1.4648 5.3223 1.3699 1.3632 1.3672 1.3743 3.3687 1.3200 1.3270 1.3589 2.0016 2.3198 2.2215 1.9780 1.7550 4.4249 2.2341 2.1436 2.6253 1.5978 1.7652 1.2121 1.2099 1.1663 1.3352 1.2164 1.4409 1.3410 1.6896 1.3973 1.4222 1.3206 2.0323 2.3474 2.6800 1.6640 1.7600 2.9328 4.5663 1.2225 1.7787 1.7346 2.4150 3.4631 4.2753 3.9964 3.6775 1.9511 1.2818 2.2111 1.6891 1.9188 2.8378 3.1913 2.8542 2.3276 1.0998 4.0516 3.7694 5.9032 6.8534 6.1651 7.3482 2.4044 6.8519 5.2885 5.8599 5.9722 6.4314 1.2376 1.0642 1.0799 1.0745 1.0578 1.1075 1.0869 1.0871 1.1068 1.0844 1.0859 1.0905 1.0892 1.0872 1.0912 1.0957 1.0938 1.0980 1.0986 1.0979 1.1004 1.0912 1.0764 1.0454 1.1027
irintensity: 0.1940 0.4497 1.2627 0.4272 0.4340 4.0053 0.1293 1.5412 1.1711 1.7125 4.5922 1.0006 11.9678 3.3707 3.2952 0.8361 0.1347 0.4324 0.9748 0.1198 5.1765 1.0866 0.2472 4.3309 2.0593 0.8896 2.4005 2.1761 1.7046 4.1793 3.3543 0.9419 2.0594 2.6716 202.0863 31.6555 1.2275 0.7734 4.1992 4.0443 2.9414 14.8117 10.9754 1.8462 7.6288 16.1758 11.8075 8.0582 21.0223 29.9189 6.5865 23.2155 28.9569 0.4182 10.7247 0.8696 2.3638 54.9110 130.8303 70.4641 43.1300 1.2410 1.0507 6.5380 2.1416 7.5272 3.7770 1.4609 4.0599 2.0412 6.5773 4.0381 2.6712 3.3827 1.8787 6.0266 1.9208 0.6533 3.6858 0.9792 4.4888 0.3043 1.2759 0.2220 2.5010 7.4765 2.7570 22.1199 3.9109 3.8080 12.8854 0.1999 9.5651 1.0620 39.0187 6.2031 1.3238 2.7697 2.1042 4.2464 0.3305 1.4749 0.2026 2.4898 2.0459 5.2114 12.1625 6.6058 2.4583 0.2539 1.8331 22.4370 21.3410 7.9017 31.2323 3.7788 10.6994 54.6960 21.0364 33.3544 28.0013 9.7471 1.1149 66.9309 62.8654 21.1806 0.0865 13.3794 16.6455 27.0194 33.7429 118.1944 267.5772 23.2064 75.9834 16.6824 114.4277 31.8324 36.0554 30.7510 22.9292 5.4362 10.7010 313.6090 52.0853 28.2424 27.5260 27.3653 8.8246 4.0359 17.1162 3.4914 5.9454 8.1208 17.3163 9.7980 3.8121 21.3008 21.3727 22.5521 33.9705 30.8062 27.8785 24.2305 20.5851 185.5770 73.3179 24.8780
temp: 298.150 k
press: 1.00000 atm
elementType: 16 7 7 7 7 6 6 6 6 6 6 6 6 6 6 6 6 6 6 6 6 6 6 6 6 6 6 6 6 6 6 6 6 6 1 1 1 1 1 1 1 1 1 1 1 1 1 1 1 1 1 1 1 1 1 1 1 1
symmnumber: 1
zpe: 1199556.3 jmol-1
zpe.correction: 0.456887 hartree
zpe.thermalcorrener: 0.484983 hartree
zpe.thermalcorrenthalpy: 0.485927 hartree
zpe.thermalcorrgfe: 0.395815 hartree
zpe.sumelectzpe: -1734.263521 hartree
zpe.sumelectthermal: -1734.235425 hartree
zpe.sumelectthermalent: -1734.234481 hartree
zpe.sumelectthermalfe: -1734.324593 hartree
dipole: -7.0905 -1.2673 2.6147
dipole: 7.6628
quadrupole: -193.6358 -183.6131 -199.5476
quadrupole: 24.1924 21.8636 4.0876
quadrupole: -1.3703 8.6524 -7.2821 24.1924 21.8636 4.0876
hfenergy: -1734.7204082 hartree
pointgroup: C01 [X(C29H24N4S1)]
dipole: 2.9641348 0.3256882 0.4434586 debye
polarizability: 417.2342665|-30.8198132|371.2707192|-117.5913393|-8.508213|374.554069 unknown
InChI: InChI=1S/C29H24N4S/c30-27-20-9-1-4-13-24(20)33-28-19(8-7-12-23(27)28)18-34-17-16-31-29-21-10-2-5-14-25(21)32-26-15-6-3-11-22(26)29/h1-15,31H,16-18,30H2
charge 0 multiplicity 1
58 atoms
S  0.171527 -3.739593 0.470448
N  -1.298639 -0.922125 1.017121
N  2.127393 -0.884784 1.12324
N  -3.789427 1.597863 -1.427881
N  4.158034 1.833664 -1.473118
C  -2.162586 -0.160169 0.241172
C  2.787975 -1.336356 0.007274
C  3.497566 -0.458452 -0.911728
C  2.766891 -2.764749 -0.261537
C  -3.524052 0.155605 0.60806
C  -1.65159 0.389543 -0.999876
C  -1.609679 -2.039018 1.922986
C  3.523732 0.952609 -0.622771
C  2.081605 -3.702394 0.695229
C  2.875714 1.430327 0.570282
C  -0.375383 -2.938765 2.104468
C  -4.289754 1.024443 -0.287883
C  -2.49649 1.290892 -1.767691
C  2.182943 0.462307 1.402289
C  4.13192 -1.022413 -2.069416
C  3.408534 -3.259851 -1.400061
C  4.086678 -2.392867 -2.312827
C  -4.169309 -0.27989 1.820309
C  -0.356488 0.058919 -1.527991
C  2.871897 2.810742 0.965192
C  -5.654699 1.344003 0.045047
C  -1.971001 1.883723 -2.969759
C  1.511057 0.929135 2.584833
C  -5.486731 0.064578 2.118168
C  0.116191 0.635709 -2.706863
C  -6.24655 0.875271 1.212502
C  -0.692869 1.574955 -3.426906
C  2.213622 3.2291 2.120122
C  1.52291 2.275484 2.937507
H  -2.469403 -2.620452 1.53593
H  -1.882672 -1.681434 2.938928
H  2.250544 -3.404238 1.741257
H  2.417051 -4.740479 0.544885
H  -0.311847 -0.907454 0.739676
H  -0.597844 -3.733095 2.835527
H  0.486093 -2.336154 2.44163
H  4.670508 -0.387835 -2.783866
H  3.391543 -4.338278 -1.597165
H  4.575325 -2.812417 -3.198215
H  -3.623827 -0.883814 2.545707
H  0.264841 -0.699998 -1.04106
H  3.393358 3.567847 0.36662
H  -6.1912 1.981959 -0.664124
H  -2.63193 2.570984 -3.507256
H  0.991643 0.182919 3.19413
H  -5.942237 -0.282908 3.052132
H  1.099459 0.346676 -3.09543
H  4.134187 2.834168 -1.302598
H  4.617596 1.513715 -2.319715
H  -7.285234 1.132111 1.449413
H  -0.312322 2.027685 -4.349869
H  2.21961 4.286407 2.404682
H  1.002518 2.612735 3.840342
