program: Gaussian 09
title: 000153629
version: EM64L-G09RevD.01
frameworkgroup: C1[X(C17H16O4)]
method: RPBEPBE
basis: SDD
operation: Freq
keyword: #pfreq=noraman
keyword: PBEPBE/SDD
title: #p freq=noraman PBEPBE/SDD
converged: YES YES NO NO
title: Mulliken charges:
elementType: O O O O C C C C C C C C C C C C C C C C C H H H H H H H H H H H H H H H H
charge: -0.308701 -0.288040 -0.208619 -0.205279 0.392911 -0.673806 0.096615 -0.454838 0.187714 -0.373408 0.138249 0.192930 0.295808 -0.342538 -0.332543 -0.345812 -0.249155 -0.226743 -0.220282 -0.530198 -0.529871 0.256563 0.275539 0.253271 0.280150 0.255490 0.248218 0.278783 0.233063 0.235499 0.235503 0.246024 0.231941 0.234073 0.232721 0.226611 0.262157
chargesum: 0.00000
title: Mulliken charges with hydrogens summed into heavy atoms:
elementType: O O O O C C C C C C C C C C C C C C C C C
charge: -0.308701 -0.288040 -0.208619 -0.205279 0.392911 -0.141704 0.096615 -0.201567 0.187714 -0.093258 0.138249 0.192930 0.295808 -0.087048 -0.084325 -0.067029 -0.016092 0.008756 0.015221 0.181840 0.191618
polarizability: 2.82342191e+02 -4.35933223e+00 1.90332946e+02 1.65943893e+01 4.99066087e+00 1.38384190e+02
1716.lowfreq: -5.8003 -4.2157 -0.0008 -0.0008 -0.0006 4.9078 11.3871 21.6662 25.6544
frequency: 10.7099 21.1642 25.5858 48.4594 66.6984 96.4111 102.2903 113.2534 139.3894 140.6994 149.4537 160.8774 167.2802 184.6552 222.7477 260.3343 286.9652 318.2201 353.1364 375.3276 399.6329 401.6576 410.3762 447.9249 451.0024 490.2526 531.9992 564.2852 572.7158 603.2469 614.2120 635.0432 668.7430 696.0772 704.9553 714.6277 752.3612 770.8039 820.7491 850.2309 858.4935 861.3521 900.1832 923.0700 944.7783 952.8511 965.3169 981.2516 989.1942 989.5753 992.0650 1011.8214 1026.8478 1042.4011 1087.0081 1088.9240 1112.8980 1115.2531 1140.5842 1150.1448 1153.3861 1169.9079 1174.1516 1188.3518 1208.7667 1229.6702 1250.1188 1281.6749 1298.2594 1319.7081 1367.1186 1388.5306 1394.6691 1424.2677 1430.1835 1436.4529 1441.9549 1456.8983 1459.8682 1475.5248 1479.1818 1487.7383 1488.2580 1549.5221 1570.0368 1589.3384 1599.4701 1610.7893 1613.3306 2972.5731 2981.1356 2989.6937 3059.9934 3067.9620 3080.8909 3122.4361 3129.6189 3130.4012 3139.4032 3150.4004 3153.2141 3159.9707 3163.9144 3170.5954 3172.8483
redmass: 6.3494 4.8421 4.1107 4.1064 5.5092 4.4594 4.9523 2.6107 4.5896 3.8341 1.2448 1.3423 2.7602 3.7340 3.6571 5.6008 6.4527 6.1652 4.3426 4.3329 2.9610 4.6279 3.5070 6.8608 3.6610 3.3725 5.7887 5.6379 3.0586 5.2976 6.3942 5.0643 5.2512 1.8317 5.1649 5.8593 3.3195 1.7349 3.6224 4.1652 1.2794 1.7343 1.6833 2.0272 8.2382 1.9638 5.1600 3.6759 1.4250 5.6477 1.3814 1.3496 2.0837 2.3483 1.6005 2.3601 1.2426 1.2427 1.2861 1.2974 1.3293 1.9252 1.0726 1.1363 2.2291 2.3935 1.5377 2.3858 2.8051 1.3924 5.7703 9.1499 3.2908 1.1981 1.1511 2.1848 1.3479 1.0559 1.0652 1.0633 2.1929 1.1081 2.4928 8.1622 6.9092 8.5481 6.8965 6.4413 6.8622 1.0303 1.0311 1.0614 1.0972 1.1052 1.1033 1.1025 1.1037 1.0851 1.0880 1.0925 1.0879 1.0961 1.0913 1.1013 1.0971
irintensity: 0.9860 0.7376 1.0076 1.3589 1.8332 3.2720 0.6092 10.4702 2.0418 1.6298 1.1924 0.5778 3.1224 4.5491 12.5935 13.5653 6.1424 0.9543 1.7248 6.6966 0.3179 1.3489 1.0178 1.0936 5.1248 6.7303 0.7693 11.7243 21.0482 59.1530 6.0417 3.8617 0.9429 48.2094 2.3863 14.0859 9.2661 54.8100 17.2833 4.7440 3.4731 28.5870 18.7192 0.8158 83.8139 7.3084 51.8394 42.6652 4.1095 3.0584 0.7280 1.5635 2.7523 17.2573 12.5815 121.5415 24.5915 1.3553 8.0683 13.2696 0.1909 28.7548 6.7634 47.0429 88.7122 71.9654 104.9322 375.1372 245.3744 20.3897 9.4282 1.8097 11.9110 2.1400 50.1621 23.1020 7.8544 14.4507 5.1254 7.0930 1.6486 6.0391 76.7788 204.3625 101.5425 92.5407 46.7636 49.9853 13.2763 55.6425 83.8130 10.1479 10.6085 27.7449 22.0276 23.3113 19.2769 0.3621 5.8668 17.8078 0.8189 17.3522 7.4252 23.8416 4.8890
temp: 298.150 k
press: 1.00000 atm
elementType: 8 8 8 8 6 6 6 6 6 6 6 6 6 6 6 6 6 6 6 6 6 1 1 1 1 1 1 1 1 1 1 1 1 1 1 1 1
symmnumber: 1
zpe: 751618.2 jmol-1
zpe.correction: 0.286276 hartree
zpe.thermalcorrener: 0.306422 hartree
zpe.thermalcorrenthalpy: 0.307366 hartree
zpe.thermalcorrgfe: 0.234106 hartree
zpe.sumelectzpe: -956.755484 hartree
zpe.sumelectthermal: -956.735338 hartree
zpe.sumelectthermalent: -956.734394 hartree
zpe.sumelectthermalfe: -956.807655 hartree
dipole: 0.8734 -4.1344 2.9129
dipole: 5.1323
quadrupole: -90.4638 -126.5774 -121.3768
quadrupole: -1.2094 2.2918 7.0304
quadrupole: 22.3422 -13.7714 -8.5708 -1.2094 2.2918 7.0304
hfenergy: -957.0417605 hartree
pointgroup: C01 [X(C17H16O4)]
dipole: -0.2306993 1.9528209 0.458802 debye
polarizability: 280.0057202|-16.0722475|180.8487491|-18.8196062|-20.4515702|150.2048574 unknown
InChI: InChI=1S/C17H16O4/c1-20-16-9-8-13(10-17(16)21-2)15(19)11-14(18)12-6-4-3-5-7-12/h3-10H,11H2,1-2H3
charge 0 multiplicity 1
37 atoms
O  2.873795 2.034679 -0.352956
O  5.168945 0.204631 -0.534489
O  -0.147078 -3.083018 1.058276
O  -1.345337 -0.602971 -1.307354
C  1.314483 -1.25119 0.503815
C  -1.212172 -0.916536 1.117698
C  -0.003749 -1.835527 0.88714
C  1.496287 0.135285 0.26173
C  2.756297 0.64517 -0.097688
C  2.429358 -2.124644 0.363962
C  -1.880439 -0.415476 -0.177634
C  3.88098 -0.230568 -0.181152
C  -3.192049 0.30938 -0.054643
C  3.695273 -1.618797 0.028766
C  -3.814294 0.568862 1.196744
C  -3.824065 0.755108 -1.248522
C  -5.043011 1.260574 1.251264
C  -5.051072 1.44366 -1.192935
C  -5.664244 1.698244 0.058288
C  3.131131 2.357097 -1.777907
C  5.748334 1.295689 0.287837
H  -0.933244 -0.037134 1.731686
H  -1.950469 -1.50027 1.696724
H  0.66445 0.844536 0.305871
H  2.272387 -3.193925 0.536158
H  4.567856 -2.272638 -0.064818
H  -3.347903 0.235465 2.129649
H  -3.32942 0.544172 -2.202444
H  -5.517282 1.45649 2.218967
H  -5.532223 1.781133 -2.117258
H  -6.619621 2.23292 0.102956
H  4.06907 1.886648 -2.126639
H  3.211799 3.453764 -1.821541
H  2.285846 2.013782 -2.402927
H  6.705818 1.540694 -0.195287
H  5.926922 0.929021 1.3158
H  5.081943 2.174691 0.313962
