program: Gaussian 09
title: 000153610
version: EM64L-G09RevD.01
frameworkgroup: C1[X(C12H10N4)]
method: RPBEPBE
basis: SDD
operation: Freq
keyword: #pfreq=noraman
keyword: PBEPBE/SDD
title: #p freq=noraman PBEPBE/SDD
converged: YES YES NO NO
title: Mulliken charges:
elementType: N N N N C C C C C C C C C C C C H H H H H H H H H H
charge: -0.456443 -0.042878 0.009197 -0.643812 0.290378 0.070440 -0.207806 0.353173 -0.309025 -0.364485 -0.360039 -0.304675 0.117908 -0.227948 -0.241187 -0.239717 0.307446 0.234938 0.285406 0.193078 0.217198 0.230298 0.226091 0.231015 0.305795 0.325653
chargesum: 0.00000
title: Mulliken charges with hydrogens summed into heavy atoms:
elementType: N N N N C C C C C C C C C C C C
charge: -0.148997 -0.042878 0.009197 -0.012363 0.290378 0.070440 -0.207806 0.353173 -0.074087 -0.079079 -0.166961 -0.087476 0.117908 0.002350 -0.015096 -0.008702
polarizability: 3.32924388e+02 -2.64728895e+00 1.51819916e+02 1.85618449e-02 6.36838272e-02 6.03697282e+01
1716.lowfreq: -4.4210 -0.0009 -0.0006 -0.0004 7.1349 7.3144 29.6618 57.5212 100.0383
frequency: 29.6485 57.5147 100.0381 146.4752 186.1366 271.6035 287.2778 291.6093 303.1618 368.6164 399.2940 399.6873 425.0138 485.7689 496.6272 504.6684 555.6429 571.7293 605.2015 616.4913 661.7590 675.4734 694.8442 697.6435 769.3119 776.5364 782.3418 796.7856 814.6053 843.9630 917.1522 924.9100 927.6026 942.0274 979.6366 987.3487 1007.1252 1021.4971 1054.2663 1068.8261 1091.9803 1121.5428 1173.0965 1189.9067 1199.1605 1245.6656 1291.6795 1297.1438 1331.5158 1341.4862 1380.8758 1387.6375 1414.6552 1443.2484 1456.6893 1468.7086 1535.6529 1571.5390 1586.4914 1612.1828 1617.0442 1624.7010 3109.4620 3131.1303 3135.6092 3144.0801 3158.3840 3160.1638 3171.4405 3559.5871 3595.5778 3715.8403
redmass: 3.8862 5.7605 4.9551 5.0174 4.3250 5.4516 4.8191 4.5996 1.2695 5.0404 3.6195 2.8114 3.1801 1.4804 2.1528 6.4777 5.8480 1.2007 5.8934 6.3005 3.3025 6.9418 1.6939 4.6709 7.1403 6.5596 2.1632 1.7832 6.2504 1.2676 6.4562 1.4365 1.3384 2.9094 1.3676 6.1277 1.3397 2.5482 2.1860 2.0163 1.9876 1.3512 1.0575 1.1245 3.0364 1.6189 3.4976 2.4182 2.1187 2.4813 6.8370 9.1443 3.5734 2.4309 2.6560 3.7386 4.8068 4.1647 5.9584 1.5089 5.9381 5.1187 1.0877 1.0866 1.0880 1.0924 1.0983 1.0964 1.0995 1.0447 1.0809 1.1047
irintensity: 3.0750 5.5626 1.5892 10.0217 1.9251 3.2644 5.9222 27.0458 178.1934 0.2064 6.1720 0.5025 1.6032 96.7741 24.4805 6.6771 0.0964 87.4503 1.2332 0.0635 0.0164 3.1160 93.9180 0.6026 0.9773 0.2361 56.6805 54.4867 1.3951 0.0653 0.1786 5.3249 0.9637 0.2497 0.3469 0.2141 0.9929 7.6616 12.0395 5.9353 10.2207 26.2502 0.0107 3.1159 8.2739 22.9493 101.3079 16.2574 23.3590 10.1896 27.6163 25.4239 128.7383 35.6728 3.4347 69.7012 8.0001 147.6497 5.8034 220.8201 20.4448 321.9861 18.4501 0.0039 5.7569 28.5789 24.8083 22.6874 19.8612 114.8477 22.1040 32.8167
temp: 298.150 k
press: 1.00000 atm
elementType: 7 7 7 7 6 6 6 6 6 6 6 6 6 6 6 6 1 1 1 1 1 1 1 1 1 1
symmnumber: 1
zpe: 524620.8 jmol-1
zpe.correction: 0.199817 hartree
zpe.thermalcorrener: 0.212230 hartree
zpe.thermalcorrenthalpy: 0.213175 hartree
zpe.thermalcorrgfe: 0.160423 hartree
zpe.sumelectzpe: -681.208602 hartree
zpe.sumelectthermal: -681.196189 hartree
zpe.sumelectthermalent: -681.195244 hartree
zpe.sumelectthermalfe: -681.247996 hartree
dipole: -0.9216 4.5166 -0.0005
dipole: 4.6097
quadrupole: -58.7214 -82.4428 -99.6475
quadrupole: -1.1189 -0.0720 0.0172
quadrupole: 21.5492 -2.1722 -19.3770 -1.1189 -0.0720 0.0172
hfenergy: -681.408419 hartree
pointgroup: C01 [X(C12H10N4)]
dipole: 0.382479 -1.7703717 0.0926024 debye
dipolederiv: -0.321534 -0.0283952 0.0021916 -0.0526519 -0.4884349 0.0122586 0.0051004 0.0117251 -0.2510528 -0.6488494 -0.2386809 0.0166338 -0.0410067 -0.3554202 0.0043027 0.0051739 0.0070437 -0.2767293 -0.8302567 -0.3673452 0.026471 0.0526087 -0.2957793 0.001279 0.0044231 0.0061801 -0.2586341 -1.4777411 -0.5646594 0.040595 -0.991715 -0.4811764 -0.0023743 0.06762 -0.0062741 -0.7583702 -0.3788251 0.1740385 -0.0027639 0.5774671 -0.2378242 0.0092788 -0.0250512 0.0144665 0.0744641 0.3321487 -0.0391795 -0.0013682 -0.0734746 0.6316465 -0.0268768 -0.000017 -0.0289474 0.0680498 0.8091009 0.3339839 -0.026756 -0.0858938 0.2579388 -0.0091721 -0.0038224 -0.0139528 0.0690512 0.4569148 0.002159 -0.0056276 -0.069349 -0.0144452 0.0033878 -0.0015043 0.002794 0.0316057 0.8764867 -0.1657216 -0.003911 -0.0656048 0.1570766 -0.0151568 -0.0095737 -0.0137246 -0.1477444 -0.2441933 0.0902324 -0.0040233 0.1212419 -0.0106349 -0.0085588 -0.0059287 -0.0074124 -0.1240289 -0.1386305 -0.0395555 0.0023604 -0.0678597 0.0325343 -0.0123485 0.0043471 -0.012849 -0.1761348 -0.5702241 0.0549156 0.0019627 -0.9463653 -0.19613 0.0115652 0.0542184 -0.00066 -0.195617 1.5385977 0.6421747 -0.0514041 1.4468892 0.5314876 -0.0370173 -0.0939364 -0.0270749 0.1642788 0.0783494 -0.1130509 0.0039103 -0.1440195 0.126166 -0.0147524 0.006444 -0.0152854 -0.1477658 -0.0321014 0.0827513 -0.0065798 0.2277993 0.0616095 -0.0155904 -0.0159186 -0.0137731 -0.1452608 -0.0761086 0.0062287 -0.0016072 -0.0909258 -0.0482523 -0.0058388 0.0042921 -0.0071722 -0.1657961 0.1838735 -0.0394339 0.0041417 -0.0527708 0.147593 0.0106925 0.0045915 0.0111598 0.337671 0.0912961 -0.0143379 0.0016261 0.0358308 -0.0974535 0.0132139 -0.0010269 0.0138515 0.1642655 0.1177305 -0.07378 0.0050987 -0.0685001 0.038749 0.0080439 0.0050065 0.0078192 0.1550098 0.0490067 0.1214683 -0.0060798 0.0988921 -0.0923739 0.0135487 -0.0048244 0.0131925 0.1479981 -0.114258 0.0852209 -0.0010772 0.0607081 0.04125 0.0065155 0.000523 0.0062574 0.1780355 0.0197321 0.0766022 -0.0028603 0.1173908 -0.080161 0.0127458 -0.0053933 0.0133164 0.1549793 -0.0131063 -0.0885139 0.0076007 -0.1312997 -0.0575684 0.0148655 0.010198 0.0143545 0.1580658 -0.1476084 0.0173827 0.0030232 0.01559 0.0908449 0.0042072 0.0031042 0.004124 0.1632744 0.2614015 0.0439317 -0.0015258 0.0320931 0.1361802 0.01357 -0.0036787 0.012802 0.3923188 0.1787982 0.0415643 -0.0000312 0.0949257 0.2025778 0.008211 -0.0043667 0.0080394 0.3880663 unknown
polarizability: 332.9190811|-0.8009202|151.5006684|-3.3406329|-5.0743805|60.6942831 unknown
InChI: InChI=1S/C12H10N4/c13-10-7-6-9-12(15-10)16-11(14-9)8-4-2-1-3-5-8/h1-7,14H,13H2
charge 0 multiplicity 1
26 atoms
N  0.130073 -1.29484 0.018678
N  0.223189 0.987986 -0.100142
N  2.678402 1.194569 -0.141252
N  5.013483 1.210455 -0.171057
C  1.489837 -0.967665 -0.01451
C  -0.59545 -0.090715 -0.034143
C  1.527123 0.470639 -0.089808
C  -2.06189 -0.02399 -0.019233
C  2.68846 -1.708214 0.010055
C  -2.683647 1.253871 -0.087821
C  -2.880387 -1.184746 0.061693
C  3.881981 -0.966668 -0.042764
C  3.837148 0.473462 -0.117669
C  -4.087391 1.364393 -0.076144
C  -4.286215 -1.069212 0.073093
C  -4.896435 0.204908 0.004223
H  -0.264973 -2.231116 0.072862
H  2.710216 -2.80145 0.066776
H  -2.038344 2.135647 -0.148987
H  -2.435493 -2.186481 0.11781
H  4.850285 -1.477499 -0.027137
H  -4.553817 2.354207 -0.129849
H  -4.905514 -1.97084 0.13599
H  -5.988395 0.29264 0.013314
H  5.926346 0.767841 -0.154101
H  4.935907 2.223416 -0.221279
