program: Gaussian 09
title: 000153608
version: EM64L-G09RevD.01
frameworkgroup: C1[X(C12H8BrN3)]
method: RPBEPBE
basis: SDD
operation: Freq
keyword: #p
keyword: freq=noraman
keyword: PBEPBE/SDD
title: #p freq=noraman PBEPBE/SDD
converged: YES YES NO NO
title: Mulliken charges:
elementType: Br N N N C C C C C C C C C C C C H H H H H H H H
charge: 0.016370 -0.454119 -0.023772 0.045291 0.083572 0.289873 0.364615 -0.207979 -0.331945 -0.289883 -0.361897 -0.145438 -0.210093 -0.226838 -0.203721 -0.373476 0.313990 0.242482 0.304700 0.201050 0.229989 0.236380 0.256801 0.244049
chargesum: 0.00000
title: Mulliken charges with hydrogens summed into heavy atoms:
elementType: Br N N N C C C C C C C C C C C C
charge: 0.016370 -0.140128 -0.023772 0.045291 0.083572 0.289873 0.364615 -0.207979 -0.089464 0.014817 -0.160847 0.084551 -0.210093 0.009542 0.053080 -0.129427
polarizability: 3.16101233e+02 -1.55384567e+01 1.73991671e+02 3.11731619e-02 1.65381362e-02 5.98625307e+01
1716.lowfreq: -3.1640 -0.0007 -0.0006 -0.0004 6.1421 10.1940 26.2332 65.0102 68.0036
frequency: 26.0494 64.9964 67.9891 154.6585 182.2251 184.7645 243.1052 273.2551 311.7714 322.6537 371.2697 429.2732 442.1791 537.9317 538.8126 567.7118 582.9426 597.6593 624.1591 644.9105 683.5524 704.3597 711.4167 784.3265 791.0546 800.9890 802.6770 887.3167 893.6509 915.7714 926.1302 940.5157 964.4707 976.4289 981.0239 1025.4699 1060.9008 1083.1636 1095.7017 1112.3032 1184.8253 1192.4048 1239.6277 1276.2402 1294.2946 1298.1609 1324.4059 1364.9731 1378.4264 1391.8579 1422.5887 1437.6197 1456.2547 1528.4599 1546.6833 1569.1426 1607.2943 1616.6468 3124.3844 3135.5897 3145.2602 3153.2489 3172.0602 3174.3042 3177.2549 3591.9308
redmass: 6.0253 5.2156 9.8346 5.2822 8.0754 4.5027 4.4335 8.4888 7.1768 5.3787 5.4402 3.6271 3.5709 5.6220 5.5082 7.7958 1.9791 1.6511 7.7386 7.0018 2.4969 8.2637 3.2138 1.5985 1.7728 3.4035 6.4282 7.1321 1.4066 1.3706 8.2563 1.4451 1.3653 1.3525 6.0322 2.4192 3.4937 1.9849 1.6320 1.5679 1.0914 2.4156 1.5182 3.0261 1.7560 2.7405 2.5888 6.8468 9.3383 2.0692 3.1782 2.3822 2.3993 4.9713 7.0296 6.5620 6.4341 7.3461 1.0881 1.0882 1.0922 1.0921 1.0992 1.0933 1.0975 1.0810
irintensity: 8.0892 0.4685 1.0906 0.0704 2.3964 0.5433 3.6969 1.4161 0.9118 1.6295 4.8371 1.2833 8.2370 4.0178 9.6952 0.5385 16.9047 48.5485 1.7766 6.5160 39.0067 41.4571 22.7976 90.7072 29.6839 12.4011 19.0751 3.4362 0.0206 0.1403 16.2305 14.9851 1.5282 0.0025 6.1261 3.3655 32.3696 5.2738 4.8346 5.5151 1.1452 0.7187 2.1997 32.2878 74.4142 3.5743 38.6340 26.3653 2.1242 29.2186 54.1877 105.8724 8.3041 35.0443 10.2708 69.7685 21.1679 1.4446 15.7035 11.8627 12.7159 12.5938 29.0036 0.4533 11.0147 24.2830
temp: 298.150 k
press: 1.00000 atm
elementType: 35 7 7 7 6 6 6 6 6 6 6 6 6 6 6 6 1 1 1 1 1 1 1 1
symmnumber: 1
zpe: 455259.7 jmol-1
zpe.correction: 0.173399 hartree
zpe.thermalcorrener: 0.185690 hartree
zpe.thermalcorrenthalpy: 0.186634 hartree
zpe.thermalcorrgfe: 0.132471 hartree
zpe.sumelectzpe: -638.711940 hartree
zpe.sumelectthermal: -638.699649 hartree
zpe.sumelectthermalent: -638.698705 hartree
zpe.sumelectthermalfe: -638.752868 hartree
dipole: 2.1569 7.1057 0.0028
dipole: 7.4258
quadrupole: -83.4164 -93.3405 -106.7224
quadrupole: 7.7222 0.0120 -0.0084
quadrupole: 11.0767 1.1526 -12.2293 7.7222 0.0120 -0.0084
hfenergy: -638.885339 hartree
pointgroup: C01 [X(C12H8Br1N3)]
dipole: 0.3227193 -2.9032516 0.049445 debye
dipolederiv: -0.3678653 0.2927952 -0.0136573 0.4306057 -0.4737179 0.0184994 -0.015487 0.0143807 -0.0332116 -0.5599031 0.0816154 -0.0093491 -0.0611595 -0.4515773 0.0009272 -0.0079642 0.005191 -0.2660426 -0.641301 -0.1909072 -0.0083156 -0.1131028 -0.3819399 -0.001509 -0.0099571 -0.0037196 -0.2541998 -0.114995 0.0144657 0.0026507 -0.0217957 -0.2793856 -0.0000627 0.0031185 0.0011666 -0.221744 0.6018807 -0.1468674 0.0174018 -0.1088102 0.5840614 -0.0101564 0.0170016 -0.0113049 0.0817962 -0.1157587 0.1264509 -0.0091624 0.5976694 -0.0635272 0.0194285 -0.0151943 0.0063381 0.1289639 0.3178462 0.0727796 0.0069194 -0.0553436 0.1047334 -0.0025065 0.0086969 0.0011978 0.0365718 0.5591658 0.1704785 0.0118895 -0.2912809 0.0968658 -0.0083813 0.018529 0.0042736 0.0587296 0.4485659 -0.0582322 0.0179898 -0.0203978 0.1294417 -0.0047379 0.0172663 -0.005886 -0.1666011 -0.4868912 0.2080959 -0.0150258 0.2688423 -0.222657 0.0099273 -0.0160361 0.0080995 -0.0643702 -0.1373578 -0.0428619 0.0021482 -0.0430487 -0.0397368 -0.0034911 0.0023202 -0.0036895 -0.175956 -0.2439125 -0.0183404 -0.0034357 -0.5500291 -0.1484397 -0.0150771 0.0040841 -0.0001479 -0.1228719 0.7297951 -0.6343204 0.033212 -0.8651201 0.8755571 -0.0385676 0.036229 -0.0317959 -0.1171389 0.0302171 -0.025762 0.0050891 0.1937052 0.1105119 0.0021644 0.0020066 -0.0041085 -0.1308285 -0.2411789 0.180732 -0.0062174 0.0890615 -0.3157517 0.0054339 -0.0051104 0.0081766 -0.1043501 -0.0301058 0.0097969 0.0016105 0.5771149 0.2808456 0.0110197 -0.0057998 -0.0049531 -0.1004789 0.2091555 -0.0393683 -0.0030483 -0.037488 0.1437092 0.0016913 -0.0031312 0.0016381 0.3398645 0.0809975 0.0057694 -0.0025088 0.0601445 -0.0827059 0.0051949 -0.0032108 0.0037285 0.1698441 0.1758542 -0.0492874 0.0011905 -0.0360793 0.0600901 0.0003264 0.0012154 -0.0000933 0.1566082 0.0118869 0.1369044 -0.0063313 0.122976 -0.0476281 0.0066325 -0.0061037 0.0071201 0.1536853 -0.1074061 0.0572483 -0.0083378 0.0614354 0.0772006 0.0029196 -0.0084275 0.0028218 0.1675907 0.0190437 -0.052312 -0.0034449 -0.0792444 -0.0833643 0.0011653 -0.0031484 0.0019938 0.1614562 -0.0519445 -0.0130934 -0.0062484 -0.005339 0.1072005 0.0006732 -0.0062593 0.0003382 0.1648912 -0.0857884 -0.0857798 -0.0050186 -0.1133158 0.0202142 -0.0015139 -0.0046378 -0.0007656 0.1377921 unknown
polarizability: 316.7246844|-10.9513973|173.1272063|7.4968942|-1.9025147|60.1035441 unknown
InChI: InChI=1S/C12H8BrN3/c13-9-4-1-3-8(7-9)11-15-10-5-2-6-14-12(10)16-11/h1-7,15H
charge 0 multiplicity 1
24 atoms
Br -4.711773 2.298913 -0.148243
N  0.969755 -1.261036 0.067157
N  0.683906 1.009352 0.026722
N  3.075614 1.61605 0.085633
C  0.056559 -0.186427 0.025624
C  2.254948 -0.717981 0.095436
C  -1.401599 -0.360452 -0.01427
C  2.055888 0.713078 0.070089
C  3.551538 -1.263515 0.138246
C  -2.208361 0.810649 -0.054828
C  -2.023798 -1.638035 -0.01416
C  4.604812 -0.322503 0.15421
C  -3.605007 0.679691 -0.094164
C  -3.429626 -1.741809 -0.054653
C  -4.238358 -0.582904 -0.095233
C  4.325054 1.076513 0.12731
H  0.733184 -2.251222 0.074783
H  3.744224 -2.34101 0.158466
H  -1.712398 1.785203 -0.054232
H  -1.428983 -2.558517 0.017499
H  5.646431 -0.656209 0.187242
H  -3.906626 -2.727328 -0.054723
H  -5.328598 -0.661774 -0.126532
H  5.151216 1.796173 0.140223
