program: Gaussian 09
title: 000153594
version: EM64L-G09RevD.01
frameworkgroup: C1[X(C23H23N5O)]
method: RPBEPBE
basis: SDD
operation: Freq
keyword: #p
keyword: freq=noraman
keyword: PBEPBE/SDD
title: #p freq=noraman PBEPBE/SDD
converged: YES YES NO NO
title: Mulliken charges:
elementType: O N N N N N C C C C C C C C C C C C C C C C C C C C C C C H H H H H H H H H H H H H H H H H H H H H H H
charge: -0.265237 -0.472793 -0.384533 -0.086544 -0.099833 -0.105752 0.205185 -0.020914 0.228494 0.200582 0.267455 0.350737 0.207305 -0.645670 -0.010414 -0.539934 -0.830976 -0.400226 -0.355785 -0.351013 -0.350058 0.304296 -0.356512 -0.344012 -0.391410 -0.196897 -0.209388 -0.325221 -0.536788 0.197732 0.301861 0.243768 0.245770 0.245640 0.207036 0.255248 0.219406 0.238380 0.296896 0.216663 0.209096 0.236273 0.232711 0.245161 0.251398 0.229221 0.257564 0.255343 0.248145 0.246355 0.217924 0.218264
chargesum: 0.00000
title: Mulliken charges with hydrogens summed into heavy atoms:
elementType: O N N N N N C C C C C C C C C C C C C C C C C C C C C C C
charge: -0.265237 -0.170932 -0.087638 -0.086544 -0.099833 -0.105752 0.205185 -0.020914 0.228494 0.200582 0.267455 0.350737 0.207305 -0.447938 -0.010414 -0.296165 -0.132530 0.074428 -0.117405 -0.114741 0.075701 0.304296 0.121361 -0.092614 -0.162189 0.060668 0.045955 -0.077076 0.145755
polarizability: 4.45290456e+02 -5.05411736e+01 3.34365834e+02 -5.30877548e+01 -1.75086787e+01 1.88100005e+02
1716.lowfreq: -7.5666 -5.9281 0.0006 0.0007 0.0011 0.8519 8.0617 12.3084 17.4889
frequency: 7.7128 11.8932 17.4590 40.8137 46.6995 65.6697 71.8875 76.7793 94.9854 102.2758 112.4188 117.8633 147.5720 168.9000 184.6160 196.8548 216.9753 246.4102 258.5812 283.8071 292.6131 308.9803 320.9522 328.6054 346.7534 356.7740 386.7504 392.0269 396.6709 433.7320 435.4063 455.4363 480.8927 508.0047 509.6371 526.8264 548.0144 562.9770 588.2152 611.5450 612.4239 624.1602 644.2619 653.8570 662.3544 716.4371 724.8771 732.4765 735.6307 747.2291 767.6327 772.0004 776.7907 778.7927 811.6164 816.4888 817.4674 837.2420 843.6911 850.3844 857.4017 871.7674 877.3391 881.2475 916.8472 939.3789 946.6317 954.3920 968.1212 996.9066 1012.3736 1032.5529 1046.9660 1054.6916 1066.2145 1074.6235 1078.6347 1103.6415 1110.8721 1112.2906 1113.2514 1135.2128 1155.6930 1168.8626 1191.8091 1216.9075 1218.8586 1230.9487 1242.7730 1256.1631 1260.3745 1265.8945 1276.1109 1293.0187 1310.7439 1315.6770 1324.2817 1325.7942 1332.0852 1360.1857 1363.0213 1368.8852 1376.4529 1400.1601 1409.2905 1416.0755 1426.6359 1431.8932 1438.2679 1443.0077 1452.8133 1456.8820 1464.9367 1466.4060 1467.1318 1468.4134 1476.4881 1479.2713 1482.8523 1483.8400 1487.2897 1529.2379 1568.9695 1594.6816 1600.7280 1629.7782 1645.2083 2951.4730 2975.7229 2979.5038 2994.5531 3029.7016 3036.0506 3036.5352 3050.8852 3076.5561 3076.8700 3093.7040 3120.9917 3122.1154 3130.6022 3140.7310 3157.5766 3172.4799 3172.8790 3219.6650 3227.8483 3248.4782 3595.9645 3620.7740
redmass: 6.2805 3.7358 5.8190 4.5801 3.6982 3.7331 3.7609 4.2563 4.6569 1.7526 2.9440 1.6664 4.2040 3.1861 4.6139 2.4533 3.5145 1.5391 3.0880 3.5581 3.2509 3.8999 4.0200 2.5030 3.7621 5.6331 1.8716 4.3436 2.7804 4.8575 2.4837 1.2899 3.4746 4.6052 2.9220 4.4430 3.5261 5.2659 5.1971 3.6820 4.6567 3.1186 5.6727 3.4452 4.3841 3.3113 1.2831 5.0166 4.5481 6.0516 3.7424 1.3457 1.5597 2.0128 1.5002 4.5694 1.6936 1.4321 3.7233 1.6159 5.4449 2.3463 2.7786 5.7531 2.3219 1.3450 1.3698 4.4882 2.4099 3.8208 3.6800 1.5144 2.1328 1.8235 2.5510 2.6672 2.2881 2.0817 1.7950 1.9612 1.2613 1.6534 1.3847 1.6361 2.5533 1.6904 2.1017 1.6902 1.3523 2.2371 1.8350 2.4856 1.4913 2.1160 2.1166 2.0383 2.1888 1.8502 4.8626 1.5034 1.8107 1.6792 2.7010 1.3822 5.1464 2.1873 2.0359 1.9832 1.7821 2.1470 1.2412 1.6141 1.0831 1.6026 1.0458 1.5372 1.9118 1.5349 1.9177 1.8946 2.0084 3.0175 5.9776 6.4893 7.3692 6.9779 7.5132 1.0334 1.0375 1.0603 1.0648 1.0601 1.1036 1.1015 1.0978 1.0973 1.0988 1.1051 1.0902 1.0986 1.0887 1.0895 1.0909 1.0955 1.0954 1.0908 1.0969 1.1098 1.0764 1.0797
irintensity: 1.1030 0.6604 0.5690 0.9432 2.6453 2.1485 5.4198 0.3528 1.3727 6.0152 0.4873 0.1040 3.0759 0.7958 5.9513 0.2898 2.4003 0.1108 1.7506 2.4619 0.4741 0.8252 0.9205 1.1249 6.6983 1.4164 24.5519 3.4276 35.9025 8.5498 1.4844 134.6072 7.6768 5.7588 2.3037 6.7030 0.9991 0.8406 3.1546 6.0666 4.4865 6.0696 11.4622 12.9054 17.6023 10.0367 24.8498 0.5375 2.4404 43.0490 0.6581 39.0448 34.3296 4.2086 42.3082 8.9664 52.1691 2.0261 8.9079 49.4748 0.5398 5.3326 3.4874 10.3944 8.9217 0.0007 0.1962 7.2835 0.1794 39.9998 25.9006 2.4691 12.1126 20.0988 3.7136 3.5345 15.8733 23.3777 1.4314 12.5700 0.1615 31.7155 0.8385 32.8745 162.4218 38.2792 50.0912 2.2766 28.4598 2.1034 23.8794 69.1008 7.4111 34.9586 42.6083 72.4314 93.3955 10.5940 0.7929 38.7767 10.9462 26.5838 41.2595 6.9711 27.3561 20.9700 25.3638 57.1902 21.5668 34.3763 16.5318 2.7259 21.2158 37.3291 12.8346 79.5911 125.6326 42.4760 52.3014 15.9476 129.6879 428.0880 39.8518 65.7477 40.6396 12.6400 66.0608 53.5008 42.8642 16.5746 82.7921 30.1726 51.2456 27.7590 15.6213 25.7503 5.2125 21.2240 11.7382 31.5043 20.2935 11.9613 8.1606 11.2357 26.8334 2.8655 2.6821 3.9058 18.0636 50.7994
temp: 298.150 k
press: 1.00000 atm
elementType: 8 7 7 7 7 7 6 6 6 6 6 6 6 6 6 6 6 6 6 6 6 6 6 6 6 6 6 6 6 1 1 1 1 1 1 1 1 1 1 1 1 1 1 1 1 1 1 1 1 1 1 1
symmnumber: 1
zpe: 1095448.1 jmol-1
zpe.correction: 0.417234 hartree
zpe.thermalcorrener: 0.442995 hartree
zpe.thermalcorrenthalpy: 0.443939 hartree
zpe.thermalcorrgfe: 0.357302 hartree
zpe.sumelectzpe: -1237.198239 hartree
zpe.sumelectthermal: -1237.172478 hartree
zpe.sumelectthermalent: -1237.171534 hartree
zpe.sumelectthermalfe: -1237.258172 hartree
dipole: 6.6969 0.8069 1.6534
dipole: 6.9450
quadrupole: -220.5462 -150.1201 -170.5127
quadrupole: -1.8746 -22.5361 -15.8329
quadrupole: -40.1532 30.2729 9.8803 -1.8746 -22.5361 -15.8329
hfenergy: -1237.6154733 hartree
pointgroup: C01 [X(C23H23N5O1)]
dipole: -2.5483605 -0.4570854 -0.8734245 debye
polarizability: 399.6222686|84.8179752|370.9903882|-28.7926062|47.8571563|197.1436386 unknown
InChI: InChI=1S/C23H23N5O/c1-15-17-6-8-26-23(25-7-3-10-28-11-9-24-14-28)20(17)13-19-18-12-16(29-2)4-5-21(18)27-22(15)19/h4-6,8-9,11-14,25,27H,3,7,10H2,1-2H3
charge 0 multiplicity 1
52 atoms
O  -3.732809 -5.018161 -1.621772
N  -4.187225 -0.020206 0.869172
N  1.800174 0.866433 -1.425304
N  1.478522 2.941768 -0.401201
N  5.50269 0.81183 1.080028
N  7.606502 0.633985 1.92327
C  -2.177551 -0.351317 -0.212325
C  -2.955801 0.587106 0.574688
C  -2.484633 1.86005 0.927632
C  -2.993805 -1.549857 -0.382198
C  -0.364222 1.283485 -0.299727
C  -1.165679 2.217673 0.479859
C  -4.229185 -1.309552 0.301117
C  -0.8940 0.00566 -0.640512
C  0.975613 1.720152 -0.701082
C  -2.776383 -2.782243 -1.046383
C  -3.322249 2.827719 1.742594
C  3.115704 1.258681 -1.95403
C  -0.593555 3.505552 0.775241
C  -5.253938 -2.278653 0.336023
C  4.311906 0.725156 -1.127676
C  -3.804904 -3.751135 -1.009785
C  4.363252 1.325819 0.295839
C  -5.02984 -3.500148 -0.324945
C  0.685228 3.809658 0.318911
C  5.552045 -0.396381 1.788709
C  6.765441 1.391095 1.187538
C  6.849241 -0.487102 2.302642
C  -2.505574 -5.34342 -2.346371
H  -0.321799 -0.710656 -1.24148
H  -4.937379 0.40197 1.40944
H  -1.834899 -2.968893 -1.571053
H  -2.813405 3.109618 2.683515
H  -3.515951 3.763403 1.184943
H  -4.303811 2.405396 2.018331
H  3.135631 2.361498 -1.975196
H  3.202737 0.889759 -2.994477
H  -1.152284 4.246619 1.351463
H  1.466943 -0.072101 -1.633757
H  5.248575 0.974002 -1.664605
H  4.266397 -0.379869 -1.05981
H  -6.199867 -2.099536 0.85767
H  4.441197 2.425362 0.239088
H  3.427326 1.102825 0.835705
H  -5.78953 -4.287367 -0.33009
H  1.137991 4.785829 0.525884
H  4.68807 -1.05091 1.873358
H  7.01163 2.347927 0.732084
H  7.278935 -1.273868 2.918485
H  -2.661069 -6.359588 -2.737683
H  -1.624512 -5.334954 -1.674075
H  -2.335487 -4.642914 -3.188189
