program: Gaussian 09
title: 000153592
version: EM64L-G09RevD.01
frameworkgroup: C1[X(C22H23N3O)]
method: RPBEPBE
basis: SDD
operation: Freq
keyword: #p
keyword: freq=noraman
keyword: PBEPBE/SDD
title: #p freq=noraman PBEPBE/SDD
converged: YES YES NO NO
title: Mulliken charges:
elementType: O N N N C C C C C C C C C C C C C C C C C C C C C C H H H H H H H H H H H H H H H H H H H H H H H
charge: -0.266755 -0.145010 -0.475067 -0.046065 -0.376070 -0.427995 -0.387252 -0.384659 -0.402447 0.009021 0.149077 0.215911 0.349511 -0.004359 0.213164 -0.619504 0.185827 0.206332 -0.353858 -0.830534 -0.395039 -0.539883 -0.353717 0.303679 -0.345747 -0.537435 0.247880 0.200352 0.213855 0.257942 0.203936 0.196332 0.197014 0.196355 0.192902 0.215261 0.267274 0.299376 0.235854 0.244044 0.243397 0.205668 0.228750 0.247515 0.234385 0.249342 0.244045 0.219434 0.217962
chargesum: 0.00000
title: Mulliken charges with hydrogens summed into heavy atoms:
elementType: O N N N C C C C C C C C C C C C C C C C C C C C C C
charge: -0.266755 -0.145010 -0.175691 -0.046065 0.072162 0.043802 0.013015 0.008710 0.005717 0.009021 0.149077 0.215911 0.349511 -0.004359 0.213164 -0.352231 0.185827 0.206332 -0.118004 -0.137425 -0.166290 -0.292368 -0.119332 0.303679 -0.096404 0.144005
polarizability: 4.22509704e+02 -1.95779268e+01 3.38487277e+02 9.50003071e+00 1.74267639e+00 1.37647951e+02
1716.lowfreq: -9.2136 -5.9881 -0.0007 -0.0006 -0.0005 2.9655 29.4740 45.8810 51.1773
frequency: 29.3387 45.8453 51.0873 65.9960 69.6223 96.7991 100.9068 113.3934 136.5173 172.7941 184.9034 196.9150 213.8379 236.4995 252.7470 254.9419 275.8517 293.4755 313.0460 317.9585 331.0397 370.0977 392.0836 397.0214 409.6059 433.9100 436.2264 449.3135 453.7341 488.1297 505.7186 515.1349 533.2121 550.3635 565.4910 594.3725 611.6618 613.1169 641.6355 659.6540 717.6006 733.7302 745.4130 770.6159 782.9260 789.3080 803.2804 810.0370 822.7488 823.8722 838.2217 852.4816 856.2894 858.7904 885.4655 906.2452 919.7220 936.4147 945.8602 950.8866 954.5009 972.9079 996.6056 1025.5074 1031.4863 1052.7483 1056.5742 1077.1921 1090.6430 1104.9197 1113.4757 1122.7713 1127.8209 1139.6694 1150.3742 1156.2133 1187.6064 1209.1945 1220.4716 1225.4189 1242.7986 1252.1735 1257.3632 1265.2569 1272.5461 1289.9618 1309.9116 1322.4586 1327.9584 1336.7071 1343.5405 1347.6626 1352.2940 1367.9264 1372.6448 1399.9513 1405.6487 1415.9720 1428.0587 1436.4247 1444.1873 1448.8090 1459.6893 1465.0214 1465.7375 1466.7730 1468.3101 1472.5326 1475.6786 1479.6195 1481.6206 1485.2045 1491.1700 1554.7990 1592.2810 1599.0025 1629.1685 1643.2184 2896.8692 2926.7257 2951.4116 2968.6862 2973.1437 2977.9097 2983.2672 3033.1916 3035.9078 3040.4578 3048.8024 3050.5709 3073.9852 3086.7871 3091.1797 3121.1160 3125.4674 3139.3602 3152.4734 3156.9640 3166.2577 3171.3490 3621.9123
redmass: 4.0071 4.1736 3.2307 4.1116 2.9535 1.7972 2.5549 2.4071 3.5357 3.6629 3.8728 3.5826 2.4178 2.6184 1.7172 2.3611 3.1976 3.0418 5.7499 3.2000 4.0969 4.5134 2.8300 4.9819 3.4252 2.1061 2.7350 3.2289 1.6560 1.9925 4.7300 3.3375 5.5061 3.8889 4.6826 4.0463 3.7352 4.5018 4.3801 5.2270 5.0509 5.0257 5.9545 4.4772 4.7953 2.3034 1.5013 1.5186 4.4319 1.9126 2.0282 1.9559 1.7234 5.3051 2.8887 2.0688 1.7122 1.3468 1.3898 1.3903 3.9289 2.5204 3.8139 2.5603 1.5085 2.3448 2.3382 1.7254 1.6114 2.0659 1.2616 2.6676 1.7325 2.0285 1.2197 1.4049 2.4897 2.0604 1.9330 1.7603 1.6451 2.0530 1.3112 1.2695 2.0031 2.5430 2.1997 3.1470 1.3194 1.4043 1.6234 1.4631 2.0512 2.5219 2.2554 1.3842 4.8701 2.1990 1.9791 2.8760 2.2963 1.1229 1.0894 1.1870 1.5074 1.1024 1.2718 1.0983 1.7377 1.4459 1.5332 1.3549 2.1249 7.7802 6.7112 7.6873 7.0111 7.7726 1.0722 1.0712 1.0334 1.0622 1.0377 1.0612 1.0615 1.0964 1.1036 1.1024 1.0976 1.1034 1.0974 1.0889 1.0909 1.0987 1.0883 1.0894 1.0911 1.0911 1.0954 1.0954 1.0796
irintensity: 0.1408 0.2660 0.3226 2.4734 3.3513 2.5749 2.7096 1.2748 1.5006 1.4732 3.5579 3.4225 1.2717 0.3926 0.1930 0.6102 7.0439 0.9670 2.6637 0.6140 0.2955 0.2108 6.6411 3.0508 2.6959 5.8848 2.5696 23.3390 75.0252 2.8645 5.0989 8.0015 4.4784 5.2213 0.0591 3.4583 6.3533 4.5858 7.5881 5.8238 1.2507 0.7115 41.6830 0.4824 8.9320 2.7116 0.7171 52.8375 1.7538 29.7685 7.9781 12.8753 31.4375 0.4665 14.6050 11.6132 18.3335 0.0709 0.5317 10.2054 13.3728 41.7054 39.7612 3.4496 2.1290 18.3571 13.0082 1.9774 3.9692 23.8532 0.2282 6.9709 39.1258 9.2462 3.6340 1.1120 127.2257 45.8079 33.9942 3.3348 118.3852 2.9802 2.6894 4.1624 15.3432 61.8801 87.6604 70.7149 1.5748 4.0820 8.7357 12.0254 43.1654 1.7842 54.7150 6.7326 38.3057 19.8139 12.2758 148.9489 59.7833 9.4480 11.4747 46.4144 66.1657 44.5870 1.6051 1.5078 195.8263 46.0143 28.9597 83.5722 99.4586 31.1569 35.2724 17.2777 12.2939 72.4057 78.7124 85.2329 52.4360 45.2394 47.2532 28.0489 41.1032 77.7378 50.4518 32.7326 16.8127 99.8076 25.6652 15.2111 11.6538 33.7012 24.0371 12.9938 1.9809 8.8956 35.7752 9.3968 47.9208
temp: 298.150 k
press: 1.00000 atm
elementType: 8 7 7 7 6 6 6 6 6 6 6 6 6 6 6 6 6 6 6 6 6 6 6 6 6 6 1 1 1 1 1 1 1 1 1 1 1 1 1 1 1 1 1 1 1 1 1 1 1
symmnumber: 1
zpe: 1057522.1 jmol-1
zpe.correction: 0.402789 hartree
zpe.thermalcorrener: 0.424985 hartree
zpe.thermalcorrenthalpy: 0.425929 hartree
zpe.thermalcorrgfe: 0.351846 hartree
zpe.sumelectzpe: -1089.789967 hartree
zpe.sumelectthermal: -1089.767771 hartree
zpe.sumelectthermalent: -1089.766827 hartree
zpe.sumelectthermalfe: -1089.840910 hartree
dipole: 1.4590 -0.2800 0.7670
dipole: 1.6719
quadrupole: -160.1905 -122.3800 -157.9704
quadrupole: 13.7777 -0.8392 1.5737
quadrupole: -13.3436 24.4669 -11.1234 13.7777 -0.8392 1.5737
hfenergy: -1090.1927562 hartree
pointgroup: C01 [X(C22H23N3O1)]
dipole: 0.559665 0.0853561 -0.3349211 debye
polarizability: 421.7977225|16.367085|337.2392688|-25.6027973|-1.9262907|139.6079412 unknown
InChI: InChI=1S/C22H23N3O/c1-14-16-8-9-23-22(25-10-4-3-5-11-25)19(16)13-18-17-12-15(26-2)6-7-20(17)24-21(14)18/h6-9,12-13,24H,3-5,10-11H2,1-2H3
charge 0 multiplicity 1
49 atoms
O  4.924443 2.642336 -0.06377
N  -3.003341 1.114726 0.154997
N  2.436403 -2.37468 -0.290913
N  -3.876039 -1.037129 0.574102
C  -4.270942 1.682452 0.677288
C  -2.538718 1.818042 -1.073408
C  -4.075488 3.17773 1.011629
C  -2.281405 3.310251 -0.784938
C  -3.556486 3.971534 -0.211176
C  -2.793087 -0.273757 0.29007
C  -1.447503 -0.832268 0.170013
C  0.976121 -0.61063 -0.006309
C  -1.318607 -2.283983 0.131817
C  1.076968 -2.053462 -0.13602
C  -0.034181 -2.905504 -0.051785
C  -0.279506 -0.015694 0.150529
C  2.334265 -0.078626 -0.075002
C  3.210472 -1.196748 -0.256131
C  -2.510022 -3.057904 0.360636
C  0.104272 -4.415569 -0.110768
C  -3.70974 -2.404591 0.635137
C  2.860883 1.234247 -0.005958
C  4.606439 -1.028267 -0.370519
C  4.260235 1.399759 -0.118203
C  5.122362 0.279401 -0.29946
C  4.097536 3.832255 0.129843
H  -4.568759 1.10409 1.565398
H  -5.086298 1.559468 -0.071525
H  -3.331403 1.734534 -1.854995
H  -1.638779 1.324796 -1.469966
H  -3.350979 3.264704 1.844978
H  -5.038086 3.596361 1.363931
H  -1.967303 3.81634 -1.718273
H  -1.451225 3.40301 -0.056414
H  -4.340298 3.98453 -0.9969
H  -3.359082 5.02466 0.064787
H  -0.374283 1.064154 0.297789
H  2.810986 -3.313704 -0.394003
H  -2.476572 -4.150543 0.362325
H  -0.1864 -4.887011 0.847629
H  -0.541351 -4.850696 -0.896161
H  1.138441 -4.733516 -0.329458
H  -4.614158 -2.971221 0.88505
H  2.192381 2.088888 0.133235
H  5.280957 -1.879574 -0.510227
H  6.197054 0.467661 -0.380899
H  4.803396 4.675766 0.14974
H  3.543302 3.78774 1.088532
H  3.380325 3.966845 -0.704374
