program: Gaussian 09
title: 000153590
version: EM64L-G09RevD.01
frameworkgroup: C1[X(C27H28N4O)]
method: RPBEPBE
basis: SDD
operation: Freq
keyword: #p
keyword: freq=noraman
keyword: PBEPBE/SDD
title: #p freq=noraman PBEPBE/SDD
converged: YES YES NO NO
title: Mulliken charges:
elementType: O N N N N C C C C C C C C C C C C C C C C C C C C C C C C C C C H H H H H H H H H H H H H H H H H H H H H H H H H H H H
charge: -0.259690 -0.473634 -0.386605 -0.054383 -0.082825 0.208673 -0.018842 0.197538 0.227488 0.361112 0.231948 0.205650 -0.655379 -0.023047 -0.529486 -0.831916 -0.354165 -0.362166 0.312889 -0.360576 -0.323438 -0.382526 -0.382639 -0.452673 -0.617718 -0.612940 0.477902 -0.390271 -0.390868 -0.227983 -0.228072 -0.231376 0.201504 0.299733 0.252617 0.244594 0.244398 0.205256 0.234393 0.235126 0.300601 0.251401 0.222945 0.255591 0.227531 0.226342 0.158895 0.207842 0.206818 0.232666 0.184660 0.224104 0.223485 0.185343 0.227970 0.235141 0.234816 0.228078 0.227973 0.230197
chargesum: 0.00000
title: Mulliken charges with hydrogens summed into heavy atoms:
elementType: O N N N N C C C C C C C C C C C C C C C C C C C C C C C C C C C
charge: -0.259690 -0.173901 -0.086005 -0.054383 -0.082825 0.208673 -0.018842 0.197538 0.227488 0.361112 0.231948 0.205650 -0.453875 -0.023047 -0.276868 -0.137668 -0.119772 -0.127039 0.312889 -0.109175 0.155098 -0.154995 0.002598 -0.038014 0.023710 0.023858 0.477902 -0.155130 -0.156052 0.000095 -0.000099 -0.001179
polarizability: 5.30616415e+02 -1.14528625e+01 3.90762706e+02 -2.74114385e+00 -8.73948315e-01 1.97648396e+02
1716.lowfreq: -13.8054 -10.5646 -2.5003 -0.0005 -0.0002 0.0005 3.5271 6.2117 15.5778
frequency: -13.4765 -7.8272 15.0346 24.0510 25.1682 44.4409 47.2502 61.0270 80.2148 86.4765 95.7064 103.5602 120.7710 136.7228 139.8700 173.0545 184.5719 192.1073 202.9659 218.6789 220.1069 228.3177 242.5331 280.8876 305.6714 315.3380 329.1250 339.8307 344.4283 360.0329 361.5097 386.3197 393.5129 403.2815 421.2862 430.8206 434.4676 455.8339 472.2628 488.0598 507.5393 509.1706 540.4428 549.2444 565.0803 594.6963 602.1010 610.9445 617.8247 625.6992 645.9567 686.4222 701.6994 731.6506 740.5116 747.6813 768.4231 774.4114 781.0469 789.7685 811.7080 816.2827 818.6859 830.0732 842.5882 850.7160 852.5892 860.9769 872.6508 877.0859 918.9180 938.4825 945.3157 947.6133 953.8266 974.6283 975.9910 980.7506 990.9365 996.6904 1025.8118 1027.1860 1033.6154 1034.2547 1055.9572 1066.1241 1075.5072 1082.5416 1090.1640 1091.9704 1106.4667 1113.4470 1132.4841 1140.2003 1172.9213 1177.4891 1180.7808 1187.6398 1194.8318 1214.9455 1228.3990 1231.6522 1233.2121 1253.3620 1262.1386 1266.3878 1284.6452 1293.1021 1300.1094 1313.8282 1322.3468 1325.7914 1335.5664 1358.8160 1374.8664 1378.6534 1387.5500 1401.1408 1408.1048 1417.6503 1418.8289 1432.0714 1439.2610 1440.9051 1441.0065 1460.9183 1464.4116 1467.7826 1469.8447 1471.4390 1475.1491 1476.1552 1480.6141 1483.9810 1484.5619 1486.1972 1487.8876 1494.2089 1525.0031 1565.9144 1593.1914 1597.5744 1599.3819 1618.1076 1628.9266 1645.1160 2781.8140 2842.8246 2858.0286 2950.9776 2974.1937 2981.7461 3008.3707 3020.3189 3021.1711 3033.1174 3049.5381 3073.5544 3074.7370 3079.8095 3091.4477 3121.9717 3124.3264 3124.8283 3126.5783 3136.0867 3139.5468 3148.9513 3157.8785 3164.7868 3169.2547 3171.1796 3579.4399 3622.1503
redmass: 3.6598 2.4909 4.9879 4.7006 4.3524 4.1477 4.5458 4.0077 3.8495 2.9706 2.9083 2.7094 1.2531 3.4066 4.5622 3.3962 5.0059 5.2293 2.1745 1.3626 2.4133 3.1091 1.6611 3.0673 4.0685 4.2986 4.1258 2.4112 2.5172 5.0107 1.7277 3.0345 6.4194 2.8170 3.2787 2.8222 2.4299 1.2839 3.8441 6.2230 3.9572 2.9528 5.2101 3.5547 5.1688 6.0545 4.7672 3.6531 6.3395 5.3539 5.6162 5.7231 1.7974 4.9441 5.3247 2.4330 4.0359 3.5792 2.0537 1.2286 1.4997 3.8142 1.8804 4.8157 3.9557 1.6133 1.2506 5.2466 3.5642 2.3235 2.0056 1.3424 3.6324 1.3901 3.0000 2.9590 1.3935 1.5803 5.5104 1.3606 2.5563 2.1733 1.5109 1.5680 3.0955 1.8127 1.8630 2.1660 1.4983 1.4001 2.0791 2.2678 1.5517 1.6241 1.0536 2.4055 1.5904 1.1419 1.0891 2.0953 2.2742 1.8240 1.6183 2.1009 2.0989 2.6062 2.3030 1.4145 1.6672 2.0747 3.1753 1.2712 1.9776 1.4225 2.9396 1.5552 8.4956 1.3714 5.7193 2.2181 1.1976 2.5487 3.0691 2.1914 1.2355 1.0509 1.0697 1.0536 2.4997 3.0199 1.1005 1.0674 2.7132 1.2423 1.0745 1.3611 2.2352 1.0779 3.9055 6.1091 6.6064 6.1447 7.4393 6.2331 7.0830 7.5002 1.0704 1.0576 1.0574 1.0555 1.0374 1.0685 1.1071 1.0720 1.0838 1.0722 1.0979 1.0959 1.0974 1.1010 1.1002 1.0851 1.0883 1.0904 1.0885 1.0921 1.0894 1.0964 1.0909 1.1017 1.0951 1.0954 1.0761 1.0796
irintensity: 0.0868 0.4310 0.0876 0.0137 0.3454 0.5377 0.6130 0.5370 4.9003 0.3222 2.4177 1.5552 1.4640 0.2047 0.2552 1.3183 1.4358 2.2416 0.0250 1.7120 0.5444 0.0978 0.3962 6.8760 2.7322 6.1065 8.3043 13.5335 0.9063 6.1583 47.9909 7.3955 4.7881 0.0196 3.4563 1.0270 1.0583 107.3836 1.7855 0.5855 10.7859 6.4797 15.2157 0.9471 2.6157 11.5868 0.3401 5.9410 0.1754 11.0901 9.3042 5.6036 43.1864 0.6929 11.3438 67.0325 0.8595 21.7579 0.8450 5.6143 42.2653 8.2778 52.0984 15.2942 22.9338 36.9101 0.3828 0.8038 6.3900 4.9132 58.4630 0.0023 32.8013 0.7242 8.5917 71.3346 0.0238 3.1423 0.8606 0.0004 26.3475 6.2398 2.6492 22.7545 32.8010 4.1584 25.1359 18.2496 7.1274 4.6099 50.8333 9.2652 52.3657 13.1032 0.0021 243.9930 18.6293 4.5234 1.2858 36.0161 34.1674 16.9141 12.4554 3.3578 62.3826 3.0636 13.5874 15.7483 27.2003 22.1751 122.3193 0.2725 16.3086 45.4483 70.2506 9.7806 0.4237 10.1969 45.0338 1.9125 5.3286 13.1964 43.1058 8.9102 1.3452 15.3266 13.7112 14.3295 175.8194 197.9202 4.1470 33.6729 25.2323 26.5762 15.9583 57.7080 16.9246 22.0294 580.3316 49.9775 63.1656 0.6835 43.1542 0.2620 12.0934 87.1656 115.4811 68.9259 210.8081 28.2967 48.1941 48.8565 28.5887 43.6862 35.8245 42.4240 16.4058 15.3408 26.9239 39.4675 45.8372 5.4040 1.7364 10.4380 25.0189 17.6139 13.7784 39.7705 14.3424 25.6029 36.1638 7.2993 29.1787 49.6636
temp: 298.150 k
press: 1.00000 atm
elementType: 8 7 7 7 7 6 6 6 6 6 6 6 6 6 6 6 6 6 6 6 6 6 6 6 6 6 6 6 6 6 6 6 1 1 1 1 1 1 1 1 1 1 1 1 1 1 1 1 1 1 1 1 1 1 1 1 1 1 1 1
symmnumber: 1
zpe: 1284016.8 jmol-1
zpe.correction: 0.489056 hartree
zpe.thermalcorrener: 0.516819 hartree
zpe.thermalcorrenthalpy: 0.517763 hartree
zpe.thermalcorrgfe: 0.429110 hartree
zpe.sumelectzpe: -1337.639463 hartree
zpe.sumelectthermal: -1337.611700 hartree
zpe.sumelectthermalent: -1337.610756 hartree
zpe.sumelectthermalfe: -1337.699409 hartree
dipole: -2.8271 0.3248 0.7476
dipole: 2.9422
quadrupole: -201.6566 -149.3443 -189.1484
quadrupole: -11.1375 4.6630 2.2779
quadrupole: -21.6068 30.7055 -9.0986 -11.1375 4.6630 2.2779
hfenergy: -1338.1285188 hartree
pointgroup: C01 [X(C27H28N4O1)]
dipole: -1.1137803 -0.0566937 -0.3101967 debye
polarizability: 531.3488881|2.8980217|389.8871896|7.3032725|1.4941344|197.7914398 unknown
InChI: InChI=1S/C27H28N4O/c1-18-21-11-12-28-27(29-13-14-31(2)3)24(21)16-23-22-15-20(9-10-25(22)30-26(18)23)32-17-19-7-5-4-6-8-19/h4-12,15-16,29-30H,13-14,17H2,1-3H3
charge 0 multiplicity 1
60 atoms
O  -4.240374 0.841235 -0.09181
N  0.3866 4.006526 -0.014784
N  3.42833 -1.705736 0.052788
N  5.280286 -0.30267 0.20764
N  4.223681 -5.401855 0.128373
C  0.799674 1.737722 0.026008
C  1.416429 3.050551 0.029147
C  -0.645148 1.941858 -0.015235
C  2.805068 3.240197 0.083801
C  3.626236 2.060092 0.125889
C  3.024828 0.733908 0.100839
C  -0.863736 3.357105 -0.04127
C  1.608149 0.595602 0.064474
C  3.931498 -0.417642 0.119661
C  -1.746684 1.051663 -0.031701
C  3.425158 4.624666 0.106864
C  -2.164742 3.901366 -0.085206
C  5.061441 2.139814 0.209195
C  -3.049789 1.599563 -0.073634
C  -3.253797 3.010135 -0.100933
C  4.298491 -2.891775 0.055947
C  5.812031 0.968103 0.262253
C  3.428636 -4.158566 0.192332
C  -4.093271 -0.632996 -0.057097
C  4.734818 -5.707873 -1.223549
C  3.513826 -6.554792 0.718822
C  -5.475926 -1.240888 -0.075607
C  -6.164742 -1.496243 1.136319
C  -6.106826 -1.553832 -1.305391
C  -7.462766 -2.053434 1.12092
C  -7.404734 -2.111216 -1.325461
C  -8.085107 -2.362878 -0.111103
H  1.132393 -0.391566 0.085601
H  0.519159 5.014048 -0.019365
H  -1.578896 -0.028883 -0.010799
H  4.0108 4.789486 1.031052
H  4.114795 4.772872 -0.74532
H  2.667312 5.425376 0.054689
H  -2.337081 4.982577 -0.105995
H  5.567792 3.107685 0.238916
H  2.448922 -1.842241 -0.191843
H  -4.283972 3.377192 -0.133661
H  4.912334 -2.916328 -0.866398
H  5.006126 -2.825112 0.898632
H  6.904643 1.005966 0.341697
H  2.921457 -4.126955 1.175464
H  2.620402 -4.142235 -0.593019
H  -3.543294 -0.917799 0.863729
H  -3.502258 -0.956658 -0.938896
H  5.360034 -4.880504 -1.597907
H  3.917678 -5.891834 -1.968414
H  5.367471 -6.612003 -1.179829
H  4.182417 -7.434175 0.727735
H  2.582527 -6.838835 0.164165
H  3.235753 -6.328231 1.763373
H  -5.684779 -1.251312 2.091541
H  -5.581774 -1.35342 -2.247206
H  -7.986501 -2.246715 2.063658
H  -7.883394 -2.349279 -2.281811
H  -9.091208 -2.797025 -0.124677
