program: Gaussian 09
title: 000153586
version: EM64L-G09RevD.01
frameworkgroup: C1[X(C14H9N3)]
method: RPBEPBE
basis: SDD
operation: Freq
keyword: #pfreq=noraman
keyword: PBEPBE/SDD
title: #p freq=noraman PBEPBE/SDD
converged: NO NO NO NO
title: Mulliken charges:
elementType: N N N C C C C C C C C C C C C C C H H H H H H H H H
charge: -0.020846 -0.037089 -0.585517 -0.317855 0.340194 0.461869 0.246705 -0.320775 0.528790 -0.440357 -0.467054 -0.434083 -0.422552 -0.447428 -0.211132 -0.214863 -0.027882 0.250201 0.276118 0.239843 0.239796 0.253527 0.222530 0.226242 0.329959 0.331658
chargesum: 0.00000
title: Mulliken charges with hydrogens summed into heavy atoms:
elementType: N N N C C C C C C C C C C C C C C
charge: -0.020846 -0.037089 0.076101 -0.317855 0.340194 0.461869 0.246705 -0.320775 0.528790 -0.190156 -0.190936 -0.194241 -0.182756 -0.193901 0.011398 0.011379 -0.027882
polarizability: 2.91488267e+02 7.58698595e+00 2.06300689e+02 5.85486851e-03 1.64066106e-03 6.47273699e+01
1716.lowfreq: -5.6591 -4.1354 -0.0011 -0.0008 0.0006 8.0615 76.5987 109.4895 174.2178
frequency: 76.5884 109.4885 174.2177 174.7993 197.2678 262.1607 324.3733 340.3849 358.3707 431.5420 461.0395 464.2605 469.2096 480.4953 484.3722 540.9959 552.0947 571.4245 606.1716 625.0986 641.1082 675.4103 721.9191 723.4827 773.1115 791.6733 794.2713 834.3639 839.7118 871.6301 919.6082 927.2869 941.2811 944.5114 955.4015 982.9816 993.3722 1010.7450 1029.2537 1042.6775 1110.8248 1131.5359 1174.8389 1196.1706 1232.2802 1236.0243 1267.3045 1298.4217 1319.6072 1358.9669 1379.1526 1399.9215 1424.7428 1452.6629 1459.1754 1481.6984 1490.3371 1521.6930 1578.1178 1602.5934 1611.7088 1613.4955 1631.3151 3125.0182 3125.9348 3129.7240 3138.0642 3146.0984 3157.7919 3164.0083 3558.3714 3719.4664
redmass: 4.8644 5.6771 4.8339 3.9359 5.6028 4.4162 5.4671 6.1618 3.6313 3.0334 1.7428 3.1487 4.8993 2.3982 6.1851 1.0306 6.9491 5.7355 7.8900 3.6159 3.6630 7.9132 3.2761 6.6568 1.7134 1.6076 5.1826 4.0988 7.8455 3.4805 1.4710 5.2337 1.4796 1.5506 3.7305 1.3734 1.3962 3.2437 2.4260 1.9221 2.6316 2.3798 1.2013 1.3600 2.0149 2.2537 3.9741 1.7705 3.4329 3.3387 2.2011 3.8869 2.1229 4.4835 4.8806 3.7725 4.0189 5.7633 7.5772 1.6993 5.5487 7.7057 7.4411 1.0862 1.0870 1.0928 1.0923 1.0926 1.0983 1.0976 1.0439 1.1060
irintensity: 3.9940 0.2239 1.1076 4.8138 1.5049 0.0201 0.6940 8.3217 9.0462 24.2973 184.8282 4.0263 0.4100 98.6301 4.3554 1.2981 7.8934 0.9414 0.3178 0.0386 2.9689 3.3294 9.8733 3.7674 0.9072 88.0698 0.1247 16.7300 1.2160 45.4682 0.1938 1.4574 0.5791 7.0523 1.5742 0.3537 2.8071 1.7106 4.2365 9.2940 13.7097 9.7876 0.0915 12.3837 19.1490 13.8660 11.2946 7.4028 30.8961 12.3420 66.5385 3.0853 6.6746 220.1173 17.0626 11.8565 18.3336 128.0114 303.8755 452.0009 83.9284 35.1537 5.0363 2.5722 1.3493 12.5863 15.6886 21.0552 39.7427 19.6588 186.3783 47.7331
temp: 298.150 k
press: 1.00000 atm
elementType: 7 7 7 6 6 6 6 6 6 6 6 6 6 6 6 6 6 1 1 1 1 1 1 1 1 1
symmnumber: 1
zpe: 516518.9 jmol-1
zpe.correction: 0.196732 hartree
zpe.thermalcorrener: 0.208330 hartree
zpe.thermalcorrenthalpy: 0.209274 hartree
zpe.thermalcorrgfe: 0.159383 hartree
zpe.sumelectzpe: -702.049394 hartree
zpe.sumelectthermal: -702.037796 hartree
zpe.sumelectthermalent: -702.036852 hartree
zpe.sumelectthermalfe: -702.086743 hartree
dipole: -0.9652 0.5866 -0.0001
dipole: 1.1295
quadrupole: -76.2582 -85.0400 -103.4083
quadrupole: 5.5879 -0.0018 0.0003
quadrupole: 11.9773 3.1955 -15.1728 5.5879 -0.0018 0.0003
hfenergy: -702.246126 hartree
pointgroup: C01 [X(C14H9N3)]
dipole: -0.382688 0.2258991 -0.0000276 debye
dipolederiv: -1.4799034 -0.2857256 -0.0000653 0.2696145 -0.3040576 0.000018 -0.0001417 -0.0000129 -0.2278591 -0.9872349 0.0783486 -0.0000569 -0.796241 -0.5704886 -0.0000817 -0.0001112 -0.0000254 -0.2524747 -1.8009757 -0.5152794 -0.0001558 -0.7418928 -0.3505292 -0.0000879 -0.0004249 -0.0001365 -0.7089511 -0.4519365 0.0028587 -0.0000014 0.2702969 0.0360328 0.0000048 -0.000059 0.0000253 -0.073001 0.4559683 0.1767908 0.0000241 -0.1233096 -0.0165989 0.0000028 0.00009 0.0000203 0.0301456 -0.4655404 -0.0111144 0.0000013 0.3266953 -0.0877856 -0.0000034 0.0000482 -0.0000449 0.0170574 -0.3791968 -0.0071433 -0.0000469 0.4817491 -0.573528 0.0000013 -0.0000063 -0.0000026 0.0650023 1.1944867 0.1264019 0.0000406 -0.3907914 0.5145539 0.0000015 0.0000441 0.00001 0.0272994 0.0602442 0.0496249 0. 0.0429588 -0.0565176 -0.0000027 -0.0000137 -0.0000057 0.0979646 -0.0253649 -0.2106904 -0.0000056 -0.1272046 0.0161186 -0.0000359 -0.0000345 -0.0000441 -0.1594586 0.2165825 0.1406129 0.0000002 -0.1116707 0.0365888 0.0000218 -0.0000227 0.0000249 -0.136054 0.0034654 0.0483308 -0.0000122 -0.1298126 0.0809142 -0.0000096 0.000049 -0.00002 -0.1948082 0.1673999 -0.0507024 -0.0000131 0.1224365 0.1217929 0.0000129 -0.0000038 0.0000236 -0.169475 0.9236771 -0.1772458 0.0000778 0.0258668 0.4453643 0.0000496 0.0000848 0.000034 -0.0577763 0.0262212 0.215887 -0.0000122 0.2266145 -0.0304274 -0.0000116 -0.0000222 0.0000055 -0.1451409 -0.2191778 -0.1863093 -0.0000093 -0.2088859 0.0625383 0.0000211 -0.00002 0.000012 -0.1564905 2.1994918 0.5620275 0.000218 0.7632663 0.5043927 0.000101 0.0003242 0.0000804 0.2122516 0.0554235 0.089446 -0.0000049 0.0563153 -0.0648788 0.0000144 0.0000013 0.0000213 0.1549547 0.0445748 -0.0873477 -0.0000033 -0.0595631 0.0035796 -0.0000076 0.0000019 -0.0000114 0.1559337 -0.1148732 -0.0188454 0.0000039 0.0401314 0.0781465 0.0000016 -0.0000208 0.000003 0.1607265 -0.1100561 0.0635881 0.0000076 0.0084691 0.0735013 -0.0000016 0.0000153 -0.000012 0.1557479 0.0935949 -0.0378166 -0.0000011 -0.0090829 -0.0938705 -0.0000171 -0.0000125 -0.0000195 0.1142059 -0.0075427 -0.1067434 0.0000063 -0.1267396 -0.070319 0.0000106 0.0000116 0.000012 0.1572771 0.0438704 0.0752328 0.0000029 0.0965809 -0.1116146 -0.000015 0.0000037 -0.0000126 0.1594677 0.2272278 0.0483069 -0.000008 0.1429814 0.2093908 0.0000275 0.0000919 0.0000644 0.3860463 0.3295741 0.0175068 0.0000132 -0.0487826 0.1477012 -0.0000148 0.0001271 0.0000108 0.3874087 unknown
polarizability: 291.2790122|8.6801186|206.5099431|0.0058333|0.0017158|64.7273699 unknown
InChI: InChI=1S/C14H9N3/c15-14-16-7-11-9-5-1-3-8-4-2-6-10(12(8)9)13(11)17-14/h1-7H,15H2
charge 0 multiplicity 1
26 atoms
N  2.318341 1.109867 0.00024
N  3.358197 -1.13137 0.00031
N  4.643448 0.826469 0.000542
C  -1.163872 0.036246 0.000017
C  -0.503992 -1.237193 0.00008
C  -0.2299 1.119167 0.000056
C  0.942934 -0.945658 0.000162
C  1.112361 0.495155 0.00015
C  -2.573237 0.208305 0.00012
C  -1.295209 -2.392977 0.000191
C  -0.707507 2.433501 0.000178
C  -3.361628 -0.994581 0.000216
C  -3.04329 1.566283 0.000179
C  2.121093 -1.714694 0.000197
C  -2.725915 -2.248166 0.000223
C  -2.128474 2.636805 0.000223
C  3.397364 0.246215 0.00038
H  -0.853211 -3.395445 0.000282
H  -0.023395 3.288002 0.000242
H  -4.456587 -0.937941 0.000231
H  -4.120261 1.773684 0.000225
H  2.115101 -2.810232 0.000089
H  -3.345053 -3.152588 0.000279
H  -2.514973 3.66218 0.000299
H  4.717946 1.840138 0.000426
H  5.464219 0.22733 0.000463
