program: Gaussian 09
title: 000153585
version: EM64L-G09RevD.01
frameworkgroup: C1[X(C14H9N3)]
method: RPBEPBE
basis: SDD
operation: Freq
keyword: #pfreq=noraman
keyword: PBEPBE/SDD
title: #p freq=noraman PBEPBE/SDD
converged: NO YES NO NO
title: Mulliken charges:
elementType: N N N C C C C C C C C C C C C C C H H H H H H H H H
charge: 0.030093 0.072162 -0.630428 -0.289195 0.492735 0.518055 -0.299641 -0.296094 0.541394 -0.470047 -0.478485 -0.423211 -0.429225 -0.214964 -0.210845 0.180298 -0.438085 0.272765 0.273097 0.238878 0.238321 0.224452 0.223414 0.231071 0.326119 0.317367
chargesum: 0.00000
title: Mulliken charges with hydrogens summed into heavy atoms:
elementType: N N N C C C C C C C C C C C C C C
charge: 0.030093 0.072162 0.013059 -0.289195 0.492735 0.518055 -0.299641 -0.296094 0.541394 -0.197282 -0.205387 -0.184333 -0.190904 0.009487 0.012569 0.180298 -0.207014
polarizability: 2.98511809e+02 -4.44793797e+00 2.04728374e+02 -8.33942511e-03 -6.45273740e-03 6.40303236e+01
1716.lowfreq: -10.1612 -5.2721 -0.0003 0.0005 0.0008 5.2894 77.2410 111.6485 174.9914
frequency: 77.2405 111.6481 174.9908 175.0944 204.6884 266.8920 323.0630 341.5257 352.6550 383.9854 454.8308 461.6821 462.5301 466.2093 483.3248 504.5095 547.6120 568.4881 619.3136 621.7297 644.0122 652.4936 692.1230 710.4305 765.5717 794.3125 794.5580 842.7726 856.1485 859.5770 881.9420 932.3070 932.7289 940.3612 979.4153 986.6692 992.5703 1003.4699 1028.9147 1039.7843 1098.6843 1142.7953 1172.5920 1196.6074 1218.3739 1233.4628 1271.4397 1306.2840 1335.1273 1346.3048 1373.5121 1400.0013 1421.6956 1445.4202 1467.0041 1479.7810 1486.8865 1525.2342 1545.8677 1612.5451 1616.8337 1620.4456 1632.6972 3124.4507 3125.8044 3126.8538 3145.3183 3146.1629 3162.5643 3163.4234 3551.1625 3705.8031
redmass: 5.1450 5.0216 3.9494 4.7828 4.8828 4.3069 5.4023 4.1442 3.6089 1.2209 4.4887 5.2523 3.2895 1.9975 6.3419 1.9612 7.0575 6.4845 3.3800 7.2624 3.6164 9.5049 3.0567 6.8068 1.3942 1.5748 5.2054 4.0088 6.8395 1.6301 3.6027 1.5072 5.3061 1.4817 3.1743 1.3945 1.3926 3.4740 2.2217 1.9117 2.5973 2.1864 1.2082 1.4165 2.3982 1.7505 4.4255 2.0074 4.0139 2.2588 3.6229 3.5858 2.0584 4.6795 5.5105 4.9148 4.4007 5.2033 6.4656 2.9396 1.8732 7.7834 7.0996 1.0915 1.0868 1.0864 1.0928 1.0928 1.0977 1.0975 1.0448 1.1045
irintensity: 6.4045 0.9211 4.4832 3.2532 1.0918 0.6001 0.5536 7.9350 4.4916 188.3942 0.6906 0.6396 3.5555 29.9772 3.8729 102.7578 7.2204 0.0933 0.0589 1.3161 3.7638 0.4728 0.9736 1.3550 0.0160 94.6386 0.1202 0.6970 0.2001 47.6989 21.9535 0.1725 0.1120 0.1660 19.6745 0.1164 3.4654 1.4506 6.6382 12.8895 21.4770 13.7290 0.4300 32.8627 7.8852 8.2605 37.5840 3.1866 91.4903 13.6687 18.9962 1.3747 0.3503 149.0483 15.7543 0.2438 16.2458 0.1025 323.5880 153.3761 193.7288 8.4461 6.3257 34.6772 2.5076 1.7491 10.5376 30.2833 36.6574 12.5246 142.9302 38.6340
temp: 298.150 k
press: 1.00000 atm
elementType: 7 7 7 6 6 6 6 6 6 6 6 6 6 6 6 6 6 1 1 1 1 1 1 1 1 1
symmnumber: 1
zpe: 515191.6 jmol-1
zpe.correction: 0.196226 hartree
zpe.thermalcorrener: 0.207932 hartree
zpe.thermalcorrenthalpy: 0.208876 hartree
zpe.thermalcorrgfe: 0.158851 hartree
zpe.sumelectzpe: -702.038172 hartree
zpe.sumelectthermal: -702.026466 hartree
zpe.sumelectthermalent: -702.025522 hartree
zpe.sumelectthermalfe: -702.075547 hartree
dipole: -1.1660 1.3496 -0.0004
dipole: 1.7835
quadrupole: -62.2006 -91.1258 -103.4409
quadrupole: -2.8142 0.0080 -0.0106
quadrupole: 23.3885 -5.5367 -17.8518 -2.8142 0.0080 -0.0106
hfenergy: -702.2343979 hartree
pointgroup: C01 [X(C14H9N3)]
dipole: -0.45087 0.5376446 -0.0055119 debye
dipolederiv: -0.9986185 0.3042896 -0.0081174 -0.2062757 -0.164813 -0.0021938 -0.006025 0.0026096 -0.2638596 0.4829452 0.0880592 0.0069103 -0.0336879 -0.1613521 -0.0003881 0.0075312 0.0008477 -0.2173028 -1.7270761 0.5191835 -0.0112552 0.8209123 -0.3375928 0.0063655 -0.0100318 0.0032646 -0.7325519 -0.5015322 -0.0063447 -0.0044528 -0.2012433 0.0695186 -0.0023332 -0.0041941 -0.0002636 -0.0841554 -0.3755216 0.0750088 -0.0043377 -0.3133485 -0.0614691 -0.0033371 -0.0040765 0.0009017 0.0232484 0.1968276 -0.2130106 0.0015876 0.1630237 -0.0493015 0.0019061 0.0012096 -0.0022117 0.0608297 0.896129 -0.1679363 0.0089788 0.7010808 0.2792708 0.0071767 0.0079047 -0.0017038 0.0733919 0.0352362 0.1504995 0.0003642 -0.7498512 -0.2887327 -0.0075809 0.0007459 0.0019568 0.0164933 0.1010578 -0.0326647 -0.0000182 -0.0123857 -0.0795742 0.0000499 0.0000293 -0.0001325 0.1014132 0.2204948 -0.1534964 0.004067 0.1209704 0.0211247 0.0011857 0.0037125 -0.001867 -0.1429339 0.0518855 0.2216675 0.0020099 0.0592383 0.0206763 0.0003359 0.0022647 0.0020985 -0.1557298 0.1532481 0.043373 0.0035115 -0.151243 0.1296805 -0.0018841 0.0036942 0.0002432 -0.172859 0.0155607 -0.0414795 0.0023294 0.1470121 0.1073339 0.0012323 0.0020881 -0.000801 -0.1904411 -0.2388271 0.1964784 -0.0010635 0.2161464 0.0552958 0.0021465 -0.0010859 0.0018924 -0.1570816 -0.0282965 -0.2428753 0.0015915 -0.2485082 -0.0312868 -0.0028264 0.0015849 -0.0027389 -0.1503806 1.8190627 -0.5327899 0.0164257 -1.1229969 0.221773 -0.0109898 0.0159587 -0.0051563 0.2516239 -0.3984241 -0.0551806 -0.002217 1.011595 -0.0082306 0.0105583 -0.0037151 -0.0001389 -0.1220354 0.0444127 0.0890394 -0.0012808 0.0608823 -0.0056153 0.0008062 -0.0012645 0.0011564 0.1555409 0.0703084 -0.0681566 -0.0008499 -0.0470167 -0.0355674 -0.0002627 -0.0008892 -0.0004482 0.1580261 -0.1140165 -0.061479 -0.0028634 -0.005301 0.0747667 0.0000219 -0.0029343 -0.000615 0.1553059 -0.1183911 0.0194763 -0.0030301 -0.0409663 0.0794048 -0.0003565 -0.0029744 0.0002979 0.1593434 0.040629 -0.0761311 -0.0012092 -0.0999799 -0.1141031 -0.0008192 -0.0011632 -0.0005664 0.1598303 -0.0066276 0.1053929 -0.0018998 0.1278723 -0.07323 0.0016508 -0.0019438 0.0014111 0.1580231 -0.1198477 -0.0839647 -0.0028834 -0.096183 0.0336126 -0.0010114 -0.0029761 -0.0010377 0.1422763 0.2003449 -0.0424999 -0.0014783 -0.1111746 0.1948165 -0.0004011 -0.0026791 0.0007111 0.3785751 0.2990366 -0.0344588 -0.0008194 0.0114285 0.1235945 0.0009486 -0.000771 0.0002899 0.3954097 unknown
polarizability: 298.3346106|-5.8198174|204.8788944|2.4927309|-0.2115351|64.0570019 unknown
InChI: InChI=1S/C14H9N3/c15-11-7-16-13-9-5-1-3-8-4-2-6-10(12(8)9)14(13)17-11/h1-7H,15H2
charge 0 multiplicity 1
26 atoms
N  -2.330567 1.113951 -0.043088
N  -2.026356 -1.771911 -0.036877
N  -4.659009 0.848769 -0.066206
C  1.152837 0.032433 -0.004914
C  0.224581 1.124025 -0.015945
C  0.485763 -1.237899 -0.0105
C  -1.118444 0.508388 -0.029782
C  -0.95536 -0.932238 -0.026204
C  2.560545 0.191377 0.010337
C  0.718448 2.431345 -0.011619
C  1.262665 -2.399517 -0.000753
C  3.046846 1.544802 0.014373
C  3.34009 -1.018943 0.020138
C  2.142868 2.622111 0.003579
C  2.695497 -2.26712 0.014594
C  -3.41122 0.255564 -0.053071
C  -3.247125 -1.172386 -0.050251
H  0.046216 3.29525 -0.019658
H  0.802523 -3.392675 -0.004382
H  4.126609 1.736054 0.025965
H  4.435024 -0.964496 0.031984
H  2.533096 3.64611 0.006841
H  3.301698 -3.180206 0.022266
H  -4.121852 -1.83289 -0.059974
H  -4.705821 1.865542 -0.071005
H  -5.513452 0.300261 -0.072549
