program: Gaussian 09
title: 000153568
version: EM64L-G09RevD.01
frameworkgroup: C1[X(C10H8N4O2S)]
method: RPBEPBE
basis: SDD
operation: Freq
keyword: #p
keyword: freq=noraman
keyword: PBEPBE/SDD
title: #p freq=noraman PBEPBE/SDD
converged: YES YES NO NO
title: Mulliken charges:
elementType: S O O N N N N C C C C C C C C C C H H H H H H H H
charge: 0.438785 -0.213640 -0.188071 0.073683 0.051147 0.114953 0.019764 0.427039 -0.424850 0.230613 -0.236566 -0.518337 -0.255337 -0.164524 -0.769091 -0.342970 -0.268209 0.296954 0.240687 0.245240 0.263787 0.235539 0.235864 0.252294 0.255248
chargesum: 0.00000
title: Mulliken charges with hydrogens summed into heavy atoms:
elementType: S O O N N N N C C C C C C C C C C
charge: 0.438785 -0.213640 -0.188071 0.073683 0.051147 0.114953 0.019764 0.427039 -0.424850 0.230613 0.060388 -0.518337 -0.014650 0.080716 -0.033902 -0.090676 -0.012961
polarizability: 2.50303885e+02 -3.16514850e+00 1.54283036e+02 5.33428687e+00 -1.58249840e+00 1.04979435e+02
1716.lowfreq: -56.6082 -7.5123 -0.0013 0.0014 0.0016 2.5407 6.7556 11.9531 36.3138
frequency: -56.5733 11.7687 36.3084 52.7046 89.4425 114.0526 156.9148 175.7945 199.3896 210.4358 247.0851 290.1920 352.3496 389.4647 417.3631 418.9772 435.3127 465.3626 488.5485 523.7191 529.4188 589.0394 631.2036 674.5986 689.9920 702.1494 741.6578 785.9138 799.1839 816.9105 852.2470 853.5400 932.5229 955.4370 981.9003 985.2892 993.5678 1016.6568 1046.2546 1049.4499 1077.3652 1107.7623 1141.5830 1175.3944 1203.6039 1221.5589 1241.0924 1266.3624 1306.7184 1329.0513 1352.0082 1390.2434 1393.7839 1399.5040 1415.2231 1451.3091 1466.9474 1511.3055 1537.7802 1547.0157 1570.1176 2989.2928 3068.5229 3124.7310 3141.0793 3142.7126 3169.0706 3170.6970 3188.6075
redmass: 1.0176 6.1185 6.2845 5.8718 11.7347 5.3509 11.3214 5.2505 4.9393 5.7561 5.4474 8.5698 11.5920 3.6542 10.9338 4.9335 4.9711 6.6984 3.5965 7.8698 6.0168 4.1648 8.1393 7.7700 7.7918 9.4304 3.4037 6.0903 9.4493 1.5298 5.3598 1.2609 8.1858 1.4085 1.6259 1.4190 1.3684 5.4807 3.1906 1.6305 1.8011 2.2124 1.9505 2.7883 4.1129 2.4963 9.0635 2.8332 2.7459 7.4530 6.1994 1.7238 1.6363 2.1020 2.1436 1.1916 1.0461 3.3928 6.2780 6.0918 6.6310 1.0384 1.0970 1.0985 1.0902 1.0896 1.0983 1.0909 1.0996
irintensity: 0.3823 1.0212 0.4044 1.5734 0.4212 2.5314 5.2535 1.3141 1.5533 0.1266 0.8503 4.5024 2.1696 1.1437 5.4191 2.6177 0.4676 5.7480 6.5035 8.3065 8.0616 11.3973 4.7061 4.9001 14.6157 16.7373 24.8698 5.3023 20.3912 36.6944 19.1334 26.5558 7.2616 0.1348 23.6185 2.0548 1.7817 1.8110 39.2608 7.8211 11.3291 75.2029 18.4880 112.1189 169.8755 94.9688 6.0640 0.8157 84.6671 77.3474 56.9721 102.9417 66.2703 81.5451 50.7641 30.5606 17.2638 66.1943 80.6086 144.6966 67.8074 9.9702 12.3318 6.1571 11.7336 8.4584 23.2475 6.0907 8.1629
temp: 298.150 k
press: 1.00000 atm
elementType: 16 8 8 7 7 7 7 6 6 6 6 6 6 6 6 6 6 1 1 1 1 1 1 1 1
symmnumber: 1
zpe: 447418.7 jmol-1
zpe.correction: 0.170413 hartree
zpe.thermalcorrener: 0.184677 hartree
zpe.thermalcorrenthalpy: 0.185621 hartree
zpe.thermalcorrgfe: 0.126462 hartree
zpe.sumelectzpe: -1152.063956 hartree
zpe.sumelectthermal: -1152.049693 hartree
zpe.sumelectthermalent: -1152.048748 hartree
zpe.sumelectthermalfe: -1152.107908 hartree
dipole: -5.2671 6.0582 0.0346
dipole: 8.0278
quadrupole: -90.3234 -101.1405 -105.3774
quadrupole: 11.3232 -0.5544 0.0760
quadrupole: 8.6237 -2.1934 -6.4303 11.3232 -0.5544 0.0760
hfenergy: -1152.2343692 hartree
pointgroup: C01 [X(C10H8N4O2S1)]
dipole: 1.7077063 2.6293499 0.3816146 debye
dipolederiv: -0.1572858 0.289541 0.1091957 0.6484239 0.0072096 -0.0567017 0.2246666 -0.0187657 -0.0048194 -1.2384467 -0.2123084 0.0286852 -0.1318325 -0.425425 -0.0468334 0.0491067 -0.040421 -0.2472246 -0.5193014 0.0116884 0.0362997 -0.0408536 -0.6372972 -0.1278917 0.0159151 -0.1342007 -0.2440936 -0.9194795 -0.2160201 0.1976128 -0.5093688 -0.3072151 0.1846433 0.3709186 0.1426537 -0.5013521 -0.3662871 -0.0294896 0.0154457 0.6748048 -0.7600295 -0.2417779 0.2202598 -0.1792002 -0.2108905 -0.9140925 -0.1393916 -0.0312793 -0.2591893 -0.2469058 0.0876956 -0.4874242 0.0160194 -0.4272929 1.5600512 0.3239818 -0.0303885 0.5753979 1.1609411 0.2461096 0.0476798 0.2682266 0.2613524 -0.5632992 0.0933642 0.0836702 -0.4235745 -0.5330831 -0.1457403 -0.0841076 -0.1879984 0.0257796 0.6645242 -0.3107361 -0.1497285 -0.9117117 0.5893053 0.240122 -0.3319153 0.1800025 0.1064731 0.3579924 0.1663688 -0.1395153 0.3006581 0.2409677 -0.2518181 -0.3362595 -0.2670904 0.666505 0.0024377 -0.1008469 -0.0326461 0.2526982 0.3650908 0.1048144 0.0735007 0.1349947 -0.0224553 1.6171706 0.1963236 -0.082258 0.4320484 0.0807965 -0.1361207 0.0617633 -0.1077048 0.3881963 -0.0902642 0.0545381 0.0156823 -0.0542108 -0.0989806 0.1363179 0.1169027 0.1724154 -0.5234275 -0.455889 -0.3098425 -0.064035 -0.2311746 -0.2085386 -0.0004684 -0.0425904 0.0078607 -0.1422099 -0.122635 -0.1030572 0.1784674 -0.1195119 -0.0653887 0.156125 0.1194193 0.1085292 -0.1563227 0.6185383 0.1853012 0.0006073 -0.2466238 0.3739922 0.1442643 -0.1204962 0.1034429 0.0191528 0.2899317 0.1534391 -0.0019353 0.160015 0.0892631 -0.1316501 0.1943359 -0.0709148 0.4102288 0.0547032 0.0105017 0.0111264 -0.0371193 0.1425632 -0.0037632 -0.00274 -0.0088514 0.1623364 -0.0535495 -0.0937989 -0.0189583 -0.12528 0.091611 -0.0015041 -0.0164974 0.0036378 0.1154178 0.0354094 0.0775584 0.0338256 0.0703091 -0.0111678 -0.0584068 0.0305967 -0.0583735 0.1458921 0.0653219 -0.0092616 -0.1263713 -0.0197997 0.1096784 -0.0410283 -0.0493193 0.0044415 -0.0028732 0.1224625 -0.0140933 -0.0027015 -0.0416802 -0.0949871 0.0001161 0.0207028 -0.0464141 0.0498077 -0.0730051 0.0703054 0.0575575 0.08446 0.0852212 -0.0107114 0.0412782 0.0279971 0.0535902 0.0665498 -0.0780073 -0.0190435 -0.0213754 -0.0572204 -0.0542017 -0.004086 -0.0497273 0.1162919 0.0184421 -0.0160579 -0.0693153 -0.0255092 0.1095989 0.0084095 -0.1116104 -0.0005593 -0.0380623 unknown
polarizability: 245.742503|19.8853406|153.8921224|-12.8303541|11.8466879|109.931731 unknown
InChI: InChI=1S/C10H8N4O2S/c1-7-4-6-12-10(13-7)17-9-8(14(15)16)3-2-5-11-9/h2-6H,1H3
charge 0 multiplicity 1
25 atoms
S  -0.073443 -1.541505 -0.49752
O  -4.577797 -1.610197 -0.176164
O  -2.557166 -2.572468 -0.643858
N  2.020098 -0.00755 -1.411226
N  -0.585796 1.015579 0.290759
N  2.098311 -0.645794 0.937046
N  -3.288601 -1.567211 -0.273979
C  -2.599524 -0.311633 0.049395
C  -1.177226 -0.176372 -0.015856
C  3.220425 0.64994 -1.290692
C  -3.394924 0.792109 0.437643
C  1.529956 -0.596629 -0.29284
C  3.889319 0.6841 -0.037266
C  -2.768278 2.008794 0.75211
C  3.778344 1.312595 -2.526657
C  -1.355018 2.068134 0.661163
C  3.293039 0.014346 1.050408
H  -4.479211 0.658221 0.47992
H  4.843592 1.206457 0.077948
H  -3.345546 2.885483 1.056632
H  3.101065 1.142303 -3.376883
H  3.892626 2.401902 -2.374366
H  4.77728 0.91056 -2.777385
H  -0.814663 2.992768 0.892746
H  3.764137 -0.011533 2.038721
