program: Gaussian 09
title: 000153567
version: EM64L-G09RevD.01
frameworkgroup: C1[X(C20H14O)]
method: RPBEPBE
basis: SDD
operation: Freq
keyword: #pfreq=noraman
keyword: PBEPBE/SDD
title: #p freq=noraman PBEPBE/SDD
converged: YES YES NO NO
title: Mulliken charges:
elementType: O C C C C C C C C C C C C C C C C C C C C H H H H H H H H H H H H H H
charge: -0.261038 -0.095601 -0.315596 -0.435232 0.356075 0.037029 -0.648826 0.473691 0.018183 -0.017586 -0.461454 0.477669 -0.828627 0.512554 -0.489893 0.481874 -0.488993 -0.483976 -0.489348 -0.460280 -0.244405 0.254292 0.245338 0.229238 0.231539 0.241491 0.233935 0.253800 0.235597 0.244478 0.240230 0.238226 0.245397 0.241538 0.228680
chargesum: 0.00000
title: Mulliken charges with hydrogens summed into heavy atoms:
elementType: O C C C C C C C C C C C C C C C C C C C C
charge: -0.261038 0.158691 -0.070258 0.025544 0.356075 0.037029 -0.173400 0.473691 0.018183 -0.017586 -0.207654 0.477669 -0.593030 0.512554 -0.245415 0.481874 -0.248762 -0.245750 -0.243951 -0.218742 -0.015724
polarizability: 3.28685389e+02 2.50939865e+01 2.63668243e+02 -1.13096720e+01 -2.47086641e+00 1.00291538e+02
1716.lowfreq: -9.9782 -2.9935 0.0004 0.0005 0.0008 5.7114 62.6419 80.5513 127.5984
frequency: 62.6211 80.5393 127.5869 164.8666 185.4567 231.1633 248.4837 268.2920 304.0778 324.2347 348.6863 366.7268 373.2149 414.6078 438.1069 451.0157 476.9094 488.6646 505.5178 516.7828 538.5057 555.3134 582.1315 608.6499 619.3840 666.7326 700.7453 705.8928 725.6695 744.3872 758.6064 772.7793 784.2466 818.9583 840.4909 843.7555 853.1620 868.6458 890.0409 902.9526 913.0061 933.8395 947.1103 964.8316 978.2319 981.9269 990.5071 1031.2758 1040.0471 1058.8585 1077.4821 1096.3920 1103.1493 1139.2792 1159.0844 1166.3307 1187.5835 1192.8405 1202.2272 1233.1088 1239.4974 1249.0553 1258.1019 1268.4363 1289.6517 1306.7828 1321.3854 1337.0925 1356.3706 1369.9687 1390.0031 1423.4611 1425.0265 1428.6276 1443.4451 1454.7425 1466.6666 1473.3228 1485.9410 1519.2096 1550.3912 1582.4885 1602.9556 1612.6057 1634.6948 2981.1263 3012.8614 3042.0919 3066.2299 3074.4658 3100.3281 3111.7534 3121.4144 3123.6229 3130.3784 3132.7360 3146.4113 3155.9988 3157.5311
redmass: 5.4556 4.5095 4.2337 4.6509 3.4093 4.4306 4.0976 4.1652 4.2220 4.0688 5.0213 3.8378 3.9535 3.7976 6.0216 4.2742 4.0763 5.0248 4.4808 4.1049 3.8040 4.4947 3.8038 4.9442 4.3034 4.1930 4.7644 3.9294 3.3841 3.9919 4.4441 1.6704 1.8695 2.4712 2.9425 2.9071 3.1690 1.6032 3.3508 1.8492 3.2601 1.7919 3.2430 1.3688 1.7322 1.4523 1.4094 2.5276 3.3162 2.7334 1.5756 1.3652 1.9283 1.9167 1.3215 1.3246 1.3511 1.5802 1.2813 2.1976 2.2531 1.6031 1.3237 2.0857 1.2198 2.3084 1.3705 1.8140 3.6733 2.0014 4.2286 3.1707 3.4330 2.5403 3.6256 4.7815 1.1133 1.1293 3.8702 5.7795 4.8539 6.4888 7.3012 6.5849 7.3423 1.0619 1.0612 1.0975 1.0877 1.1004 1.0934 1.0906 1.0862 1.0860 1.0881 1.0917 1.0984 1.0968 1.0990
irintensity: 0.7890 0.6572 6.7259 0.5894 1.3831 5.6158 0.2556 1.4716 2.8700 3.4000 1.3089 4.2923 0.1436 2.2351 2.6120 0.5841 0.1542 1.1259 1.6886 0.5923 1.4425 1.0510 0.3243 2.6652 3.8628 3.2436 6.2847 3.1330 18.9820 12.6509 1.4063 11.0857 5.6028 8.6664 47.9708 5.0661 0.2335 47.1275 27.2843 52.0630 7.1508 11.5563 4.0788 0.2581 7.0473 2.8301 0.5872 0.7473 0.4650 7.3352 13.4984 4.0945 6.9590 0.9672 2.9205 1.0043 0.3906 15.7146 10.2391 0.7587 0.5087 3.9391 4.9529 1.0792 4.6445 11.9270 1.4721 5.8481 10.6965 0.5166 4.8220 0.8352 2.1691 10.8643 16.6909 1.3577 8.8277 13.9009 1.0008 2.3589 0.9967 3.7432 4.3020 10.2914 2.4616 21.6750 44.3586 26.9886 12.0887 10.3040 35.3781 18.2042 1.3033 0.8304 5.9297 15.8316 33.5996 26.6416 35.3359
temp: 298.150 k
press: 1.00000 atm
elementType: 8 6 6 6 6 6 6 6 6 6 6 6 6 6 6 6 6 6 6 6 6 1 1 1 1 1 1 1 1 1 1 1 1 1 1
symmnumber: 1
zpe: 726148.7 jmol-1
zpe.correction: 0.276575 hartree
zpe.thermalcorrener: 0.290826 hartree
zpe.thermalcorrenthalpy: 0.291770 hartree
zpe.thermalcorrgfe: 0.236407 hartree
zpe.sumelectzpe: -844.321204 hartree
zpe.sumelectthermal: -844.306954 hartree
zpe.sumelectthermalent: -844.306009 hartree
zpe.sumelectthermalfe: -844.361373 hartree
dipole: -2.2313 -1.6047 -1.0380
dipole: 2.9379
quadrupole: -122.0959 -104.2169 -125.9984
quadrupole: -7.7400 -7.6274 -0.9900
quadrupole: -4.6589 13.2202 -8.5613 -7.7400 -7.6274 -0.9900
hfenergy: -844.5977797 hartree
pointgroup: C01 [X(C20H14O1)]
dipole: 0.907347 -0.5889011 0.4073723 debye
polarizability: 331.139403|-21.5988682|261.2573533|-10.7644844|2.9698599|100.2484141 unknown
InChI: InChI=1S/C20H14O/c1-2-11-4-5-12-6-8-15-18-14(7-9-16-20(15)21-16)10-13(3-1)17(11)19(12)18/h1-6,8,10,16,20H,7,9H2
charge 0 multiplicity 1
35 atoms
O  -4.446605 0.387583 -0.771327
C  -3.429933 -0.743586 -0.815293
C  -3.304311 0.291006 0.239427
C  -3.478263 -2.166148 -0.304273
C  -1.983867 0.986267 0.230009
C  -0.8526 0.08949 0.222562
C  -2.230283 -2.210797 0.661319
C  -0.958883 -1.393803 0.292595
C  0.464785 0.687868 0.117807
C  1.646777 -0.126197 0.008741
C  -1.82161 2.385475 0.207366
C  0.611857 2.128761 0.090897
C  0.210648 -2.134966 0.162734
C  1.522152 -1.558264 0.003273
C  -0.538016 2.957448 0.149786
C  2.954212 0.473419 -0.11033
C  1.93545 2.706563 -0.012634
C  3.063509 1.915142 -0.107965
C  2.686148 -2.364241 -0.124654
C  4.094832 -0.365561 -0.235014
C  3.959742 -1.770091 -0.24367
H  -2.771595 -0.604939 -1.683737
H  -3.722118 0.052278 1.228373
H  -3.386094 -2.901656 -1.122381
H  -4.398007 -2.392099 0.264589
H  -1.92015 -3.262381 0.801596
H  -2.574287 -1.857434 1.653312
H  -2.714435 3.019077 0.207281
H  0.149878 -3.229696 0.213436
H  -0.416296 4.046375 0.127907
H  2.020847 3.799484 -0.020216
H  4.058819 2.366974 -0.190517
H  2.584894 -3.455786 -0.127252
H  5.086392 0.092354 -0.329166
H  4.848811 -2.402116 -0.342577
