program: Gaussian 09
title: 000013698
version: EM64L-G09RevD.01
frameworkgroup: C1[X(C14H11N)]
method: RPBEPBE
basis: SDD
operation: Freq
keyword: #pfreq=noraman
keyword: PBEPBE/SDD
title: #p freq=noraman PBEPBE/SDD
converged: NO YES NO NO
title: Mulliken charges:
elementType: N C C C C C C C C C C C C C C H H H H H H H H H H H
charge: -0.500790 0.315961 0.206159 0.299469 -0.518264 0.339782 -0.365902 -0.421077 -0.382834 -0.390788 -0.218300 -0.250571 -0.235957 -0.239056 -0.243646 0.309833 0.253846 0.230353 0.237702 0.236635 0.212116 0.220976 0.220479 0.226833 0.226095 0.230946
chargesum: 0.00000
title: Mulliken charges with hydrogens summed into heavy atoms:
elementType: N C C C C C C C C C C C C C C
charge: -0.190957 0.315961 0.206159 0.299469 -0.264418 0.339782 -0.135549 -0.183375 -0.146199 -0.178672 0.002676 -0.030092 -0.009124 -0.012960 -0.012700
polarizability: 3.04882471e+02 3.01850044e+00 1.51722334e+02 7.50403163e-01 -5.37489490e-01 6.40328328e+01
1716.lowfreq: -2.0727 -0.0008 -0.0006 0.0001 0.6635 11.1520 43.5823 63.5519 100.5310
frequency: 43.5522 63.5480 100.5309 182.5826 247.2030 282.3070 292.1955 336.8077 402.0530 427.3128 481.6277 516.1056 527.0631 558.3719 572.6854 602.2941 617.0486 657.5809 669.9951 696.1485 741.6426 752.4004 771.9156 790.4282 811.7082 843.7656 853.7253 883.7745 914.2715 923.9552 930.5285 970.5034 972.6369 987.2513 993.8029 1009.6101 1023.9638 1052.7488 1083.4267 1114.8084 1164.1148 1173.4042 1189.2093 1193.8195 1232.0900 1252.5601 1303.7308 1319.6545 1332.1347 1372.2380 1383.7559 1416.4923 1441.9118 1459.9313 1472.6888 1488.5552 1555.4020 1582.5230 1591.8235 1616.7849 1630.5748 3117.0220 3123.8498 3128.5395 3131.8973 3140.5009 3145.7683 3151.1019 3163.0431 3166.9380 3215.4615 3607.9476
redmass: 3.6473 5.2132 4.5585 4.8908 3.6788 6.6102 4.5423 4.7481 2.7964 2.9688 3.6772 2.2909 1.4723 5.8930 3.5198 6.5314 6.2114 2.9958 6.2500 1.8468 1.3029 2.6480 1.9134 4.0656 1.5453 1.2688 1.5584 4.9613 1.4986 6.2608 1.3881 1.3072 1.4364 5.2355 1.3207 2.1886 2.5797 1.9363 1.6125 1.6126 1.0981 1.0602 1.5196 1.1176 2.0373 1.6453 1.8878 3.5606 1.5546 2.5822 7.9587 2.9236 2.4759 4.6453 2.3338 3.1718 5.7117 6.0807 5.6905 6.0967 7.2277 1.0867 1.0850 1.0860 1.0890 1.0916 1.0954 1.0959 1.1002 1.1015 1.0974 1.0800
irintensity: 0.5165 0.5941 0.1859 0.6392 0.6285 0.0740 1.6251 0.8098 0.0508 4.9106 2.8443 11.3487 82.1174 13.0083 0.4096 2.3015 0.8468 1.4974 1.4317 46.7351 24.4538 66.7975 89.6496 0.3350 39.8465 0.1914 5.6556 0.5989 3.9248 0.3952 5.4426 0.0348 0.1060 0.4174 0.1701 5.7133 5.9855 11.1872 10.8322 6.2365 2.1249 0.0102 7.8351 0.3163 9.3841 19.3814 3.5295 33.1182 2.3586 36.2187 18.9135 17.9497 13.7563 8.6864 27.1559 2.4608 5.1254 2.3211 1.2146 47.8127 0.0996 14.1412 0.9270 1.1642 2.5430 15.6802 34.6321 36.2321 44.1926 24.2694 4.1435 36.6176
temp: 298.150 k
press: 1.00000 atm
elementType: 7 6 6 6 6 6 6 6 6 6 6 6 6 6 6 1 1 1 1 1 1 1 1 1 1 1
symmnumber: 1
zpe: 544117.5 jmol-1
zpe.correction: 0.207243 hartree
zpe.thermalcorrener: 0.218352 hartree
zpe.thermalcorrenthalpy: 0.219296 hartree
zpe.thermalcorrgfe: 0.169563 hartree
zpe.sumelectzpe: -593.843996 hartree
zpe.sumelectthermal: -593.832887 hartree
zpe.sumelectthermalent: -593.831943 hartree
zpe.sumelectthermalfe: -593.881676 hartree
dipole: -1.3809 -1.2633 -0.2960
dipole: 1.8948
quadrupole: -78.2618 -73.0948 -95.1923
quadrupole: -0.5846 0.0863 0.4509
quadrupole: 3.9211 9.0882 -13.0093 -0.5846 0.0863 0.4509
hfenergy: -594.0512394 hartree
pointgroup: C01 [X(C14H11N1)]
dipole: -0.5436828 0.4973575 0.1130293 debye
dipolederiv: -0.468167 -0.0672645 -0.0234658 0.2451592 -0.4810818 -0.0073375 -0.098151 0.0374173 -0.2658976 -0.2251248 0.1018046 0.0277352 0.1529017 0.4779776 0.0852707 0.1102788 0.020523 0.0297152 0.1604582 -0.087644 -0.0116037 -0.4323906 -0.0201294 -0.0193219 -0.0459265 -0.0147389 0.0447152 0.0641797 -0.02596 -0.0008936 0.3061379 -0.1257095 -0.0257518 0.0026374 -0.0187667 0.0134811 -0.0587971 0.1466754 0.0201428 -0.0255171 -0.0754777 0.0383904 0.0584468 0.0391585 -0.2560832 0.8445321 -0.0787576 -0.0128146 -0.0760203 -0.0078558 -0.0058372 -0.0538806 0.0218771 0.0355348 0.1843091 0.0873505 0.0148604 0.0961084 0.0582146 0.0354258 0.0339341 0.0322015 -0.1970069 0.2250999 0.0168849 0.0007314 -0.0766849 0.1164375 0.0423687 -0.0175138 0.0404856 -0.1694474 -0.3453384 -0.022717 0.0229 -0.1709472 0.0311466 -0.051967 0.0382828 -0.0407094 -0.1396862 -0.2523918 0.0352492 -0.0286939 0.2088299 -0.0123621 -0.0639686 -0.0468265 -0.0654266 -0.1586347 -0.2462787 0.0000314 0.0011769 0.2130936 0.08313 0.0383836 0.0268348 0.0384293 -0.1760722 -0.0984037 -0.0861769 -0.0118693 -0.3361438 -0.0581003 0.0190804 -0.0391549 0.0180641 -0.1842424 0.1352585 0.0550613 -0.021355 0.0875855 0.0976672 -0.0558391 -0.051222 -0.0580371 -0.1298693 0.0400715 -0.040427 0.0109865 -0.1517856 0.1048674 -0.0544743 0.0524009 -0.0629514 -0.1311909 -0.100687 -0.0054033 -0.0009984 0.0560325 -0.1095553 -0.0165129 -0.0151484 -0.0132828 -0.173378 0.1955928 0.0258812 0.0020719 0.0059464 0.1782018 -0.0250262 0.0348999 -0.0335288 0.3091178 0.0596473 -0.058223 -0.0078714 -0.0878953 -0.0101 -0.0344434 -0.0130684 -0.033317 0.1792371 0.0775029 0.0406294 0.0041173 -0.0283962 -0.1088289 -0.0416803 -0.0028607 -0.0388782 0.1704062 0.0808843 -0.0099947 -0.0002627 0.0496246 -0.10568 -0.0387756 0.0032334 -0.0362136 0.1552422 0.0634361 0.0967741 -0.0241064 0.072706 -0.0291987 0.0463729 -0.022179 0.0391854 0.1348509 0.0313828 -0.1167394 0.0325523 -0.1046386 -0.0417923 0.0530675 0.0362542 0.049413 0.1337373 -0.0961913 -0.1019061 -0.0152649 -0.1060879 0.0233433 -0.0208002 -0.0218918 -0.020636 0.160575 -0.1367599 0.0900957 0.0127704 0.0936429 0.0449215 -0.0174618 0.0159779 -0.0177511 0.1633017 -0.0012762 -0.0845176 0.0214812 -0.1231069 -0.051822 0.0511206 0.0336312 0.050236 0.1441951 0.0134884 0.0785994 -0.0158605 0.1196547 -0.0708914 0.0523065 -0.025902 0.0533106 0.1450944 -0.1464277 0.0106939 0.0035341 0.0121911 0.0926777 0.0174106 0.0069135 0.0139362 0.1623047 unknown
polarizability: 304.8872461|-2.9013194|151.7061439|-0.7209166|-1.1381951|64.0442482 unknown
InChI: InChI=1S/C14H11N/c1-2-6-11(7-3-1)14-10-12-8-4-5-9-13(12)15-14/h1-10,15H
charge 0 multiplicity 1
26 atoms
N  0.500296 1.030686 0.134137
C  -0.307346 -0.11823 -0.013788
C  1.850337 0.671601 0.091947
C  1.903694 -0.756994 -0.105065
C  0.540438 -1.226311 -0.164046
C  -1.774462 -0.038561 -0.009575
C  3.013419 1.463183 0.212006
C  3.173083 -1.390103 -0.197858
C  -2.555805 -1.196478 0.268779
C  -2.456432 1.18287 -0.279525
C  4.257533 0.805863 0.122247
C  4.335797 -0.604979 -0.082486
C  -3.963124 -1.135226 0.274146
C  -3.865753 1.245142 -0.262726
C  -4.628402 0.087111 0.013632
H  0.147542 1.961846 0.343345
H  0.216202 -2.250686 -0.339905
H  2.959727 2.546863 0.365742
H  3.244643 -2.47228 -0.353555
H  -2.050658 -2.140319 0.500826
H  -1.889709 2.084423 -0.543142
H  5.181885 1.387764 0.209438
H  5.321363 -1.07896 -0.149794
H  -4.543996 -2.038282 0.492606
H  -4.369256 2.194499 -0.477029
H  -5.722617 0.13496 0.024442
