program: Gaussian 09
title: 000153520
version: EM64L-G09RevD.01
frameworkgroup: C1[X(C24H13F)]
method: RPBEPBE
basis: SDD
operation: Freq
keyword: #pfreq=noraman
keyword: PBEPBE/SDD
title: #p freq=noraman PBEPBE/SDD
converged: NO YES NO NO
title: Mulliken charges:
elementType: F C C C C C C C C C C C C C C C C C C C C C C C C H H H H H H H H H H H H H
charge: -0.203926 0.018057 0.013427 0.327869 0.340535 0.525412 0.524364 0.197398 0.152206 0.475800 0.465534 -0.469492 -0.486999 -0.825965 -0.821947 -0.505559 -0.504338 -0.519113 -0.344228 -0.432496 -0.460323 0.318695 -0.261382 -0.401760 -0.250592 0.225540 0.225940 0.249903 0.246654 0.243558 0.243910 0.253220 0.224783 0.250754 0.246298 0.229126 0.258057 0.231078
chargesum: 0.00000
title: Mulliken charges with hydrogens summed into heavy atoms:
elementType: F C C C C C C C C C C C C C C C C C C C C C C C C
charge: -0.203926 0.018057 0.013427 0.327869 0.340535 0.525412 0.524364 0.197398 0.152206 0.475800 0.465534 -0.243952 -0.261059 -0.576062 -0.575292 -0.262002 -0.260429 -0.265893 -0.119445 -0.181741 -0.214025 0.318695 -0.032256 -0.143702 -0.019513
polarizability: 5.89277744e+02 2.12347524e+01 2.88676374e+02 -6.08440645e-03 3.30169000e-03 9.45504381e+01
1716.lowfreq: -5.8343 -0.0011 -0.0006 0.0009 7.3344 8.2009 40.2969 57.4863 93.5226
frequency: 40.2740 57.4814 93.5222 119.2137 130.3759 164.5466 195.3324 236.1866 241.1431 267.6236 274.8846 323.3261 342.3864 351.3072 388.5215 416.0334 427.0264 443.3112 470.7645 481.9697 492.1109 509.8556 523.8854 533.3757 544.2778 553.3037 557.3613 591.8048 596.4177 634.1522 648.9433 679.6484 690.3161 693.0205 758.5785 761.3105 777.2635 781.2731 790.0207 806.8200 827.8692 835.7375 847.3965 852.3450 858.2848 872.6256 876.3991 885.3165 921.8956 938.4966 941.7648 959.4018 964.1920 974.8509 989.0802 992.9945 1027.1564 1036.8824 1044.2700 1099.8054 1121.5452 1139.9314 1153.5482 1168.6797 1179.5300 1192.6130 1211.7048 1218.3498 1257.4709 1261.4681 1282.9104 1291.4908 1296.2883 1323.4464 1332.1813 1390.0663 1401.6747 1407.1139 1411.5300 1417.4994 1426.2245 1429.9750 1447.8456 1468.9480 1477.8228 1486.4982 1514.9271 1536.4740 1576.3421 1578.5976 1597.1490 1609.3530 1619.2371 1629.8739 1637.0509 3118.5716 3119.9356 3121.2384 3122.7504 3133.0138 3136.8335 3141.1171 3144.8291 3151.0970 3162.8225 3167.7935 3175.6614 3178.2985
redmass: 5.9813 5.4411 4.2766 4.9244 7.5005 4.0883 5.4696 6.5296 4.7783 4.6208 7.8967 4.3390 6.8684 4.4495 6.9559 3.5932 6.0209 3.2159 3.0769 5.4946 6.3873 6.5157 3.4646 3.0062 6.1429 6.8747 3.0613 6.3597 3.9978 6.3224 6.8085 6.8620 3.4172 3.4907 1.3199 2.3065 2.0454 6.4962 5.4967 1.3645 1.5296 4.7135 5.7881 1.6636 1.9004 1.7470 1.9483 5.5129 1.9659 5.5649 2.0210 1.4155 1.5344 1.4351 1.4001 1.4641 3.4842 3.9481 2.5814 2.1440 2.7013 1.5462 1.5154 1.8023 1.1663 1.2777 1.3687 1.3909 1.9507 1.9455 1.7442 2.7442 2.0998 2.7602 2.9468 2.6969 7.0855 3.4259 3.4835 3.5468 3.1810 5.1240 4.1211 4.3902 3.1302 3.7244 5.2352 4.1067 5.9877 8.6293 6.7519 6.4003 6.4870 6.8346 7.1538 1.0887 1.0896 1.0894 1.0866 1.0882 1.0896 1.0876 1.0986 1.0934 1.0988 1.0963 1.0914 1.0960
irintensity: 0.0956 0.6633 0.0482 0.0000 0.1794 3.5021 2.8478 0.2639 2.0095 0.0188 0.2103 0.0003 4.6381 0.0210 2.7537 0.2978 2.6526 8.3725 0.0011 0.3689 7.9676 3.7633 1.4656 7.4532 4.0858 0.5484 5.1822 8.8719 0.4946 3.7468 0.0112 1.1569 0.1687 8.1464 52.1272 29.5418 44.3976 25.4345 3.4356 8.7395 4.1416 0.2714 0.9020 24.5698 0.1007 5.1020 22.5507 1.7270 30.9045 31.6170 41.2718 3.2951 27.9361 2.0699 0.2048 1.4549 3.6864 1.8124 4.1486 2.2573 15.4468 2.1013 19.5883 79.8234 5.0807 2.7557 9.6598 0.7192 27.4918 1.7858 0.7012 4.3770 1.0280 3.2206 0.3977 0.1033 2.3625 0.9121 3.0097 1.6227 1.3248 13.1777 13.1612 3.6820 32.9616 64.9908 1.4544 5.0626 23.1604 2.3259 3.7078 19.3951 28.6797 6.9979 19.1907 0.8501 7.3182 5.3883 6.1324 5.8164 10.0639 6.6091 37.8855 20.5909 21.0318 41.1349 11.2387 10.9240
temp: 298.150 k
press: 1.00000 atm
elementType: 9 6 6 6 6 6 6 6 6 6 6 6 6 6 6 6 6 6 6 6 6 6 6 6 6 1 1 1 1 1 1 1 1 1 1 1 1 1
symmnumber: 1
zpe: 756668.3 jmol-1
zpe.correction: 0.288200 hartree
zpe.thermalcorrener: 0.304906 hartree
zpe.thermalcorrenthalpy: 0.305850 hartree
zpe.thermalcorrgfe: 0.244403 hartree
zpe.sumelectzpe: -1020.647012 hartree
zpe.sumelectthermal: -1020.630306 hartree
zpe.sumelectthermalent: -1020.629362 hartree
zpe.sumelectthermalfe: -1020.690809 hartree
dipole: -1.8277 1.5855 0.0000
dipole: 2.4196
quadrupole: -130.3460 -124.6984 -151.7227
quadrupole: 12.0887 -0.0001 0.0004
quadrupole: 5.2430 10.8906 -16.1337 12.0887 -0.0001 0.0004
hfenergy: -1020.9352119 hartree
pointgroup: C01 [X(C24H13F1)]
dipole: 0.7110244 0.6329445 -0.0000052 debye
polarizability: 589.7720202|-17.3807458|288.1820981|-0.0060417|-0.0033793|94.5504381 unknown
InChI: InChI=1S/C24H13F/c25-18-8-7-15-12-17-6-5-16-11-14-3-1-2-4-19(14)20-9-10-21(22(15)13-18)24(17)23(16)20/h1-13H
charge 0 multiplicity 1
38 atoms
F  -5.791413 -2.524958 0.000191
C  -0.444462 0.625199 0.000066
C  0.994071 0.524029 0.00006
C  -1.257456 -0.557768 0.000095
C  1.635417 -0.760242 0.000075
C  -1.074876 1.939387 0.000062
C  1.802217 1.736936 0.00003
C  -2.7108 -0.441056 0.00012
C  3.091737 -0.848297 0.000073
C  -3.310156 0.879215 0.00012
C  3.868313 0.374549 0.000031
C  -0.590003 -1.827725 0.000094
C  0.79635 -1.924739 0.000086
C  -2.471688 2.037142 0.000092
C  3.198796 1.63851 0.000007
C  -0.235234 3.125294 0.000028
C  1.136761 3.028698 0.000016
C  -3.576839 -1.578564 0.000152
C  3.798459 -2.092168 0.000115
C  -4.739137 1.007509 0.000148
C  5.300733 0.303004 0.000008
C  -4.954963 -1.390866 0.000175
C  5.197742 -2.13645 0.000094
C  -5.571419 -0.112809 0.000175
C  5.959131 -0.928139 0.000032
H  -1.176673 -2.750848 0.000099
H  1.249022 -2.92029 0.000078
H  -2.94112 3.028728 0.0001
H  3.802463 2.554969 -0.000033
H  -0.726758 4.105196 0.00002
H  1.760723 3.930137 -0.000013
H  -3.188747 -2.599828 0.000139
H  3.244326 -3.035478 0.00019
H  -5.177218 2.011813 0.000149
H  5.872445 1.238728 -0.000026
H  5.712739 -3.103435 0.000144
H  -6.661941 -0.032263 0.000197
H  7.053659 -0.971819 0.000011
