program: Gaussian 09
title: 000153476
version: EM64L-G09RevD.01
frameworkgroup: C1[X(C18H17NO4S)]
method: RPBEPBE
basis: SDD
operation: Freq
keyword: #p
keyword: freq=noraman
keyword: PBEPBE/SDD
title: #p freq=noraman PBEPBE/SDD
converged: YES YES NO NO
title: Mulliken charges:
elementType: S O O O O N C C C C C C C C C C C C C C C C C C H H H H H H H H H H H H H H H H H
charge: 0.745908 -0.540729 -0.524743 -0.219455 -0.238653 -0.455896 -0.159051 0.320607 -0.134708 0.368394 0.054794 0.523540 -0.520561 -0.269621 -0.546630 -0.518748 -0.400275 -0.346120 0.512214 -0.357570 -0.360341 -0.681292 0.234347 -0.777878 0.292275 0.282552 0.214735 0.207082 0.280221 0.253005 0.288291 0.212724 0.219443 0.320467 0.213937 0.210750 0.226554 0.320379 0.265284 0.265403 0.219366
chargesum: 0.00000
title: Mulliken charges with hydrogens summed into heavy atoms:
elementType: S O O O O N C C C C C C C C C C C C C C C C C C
charge: 0.745908 -0.540729 -0.524743 -0.219455 -0.238653 -0.135517 -0.159051 0.320607 -0.134708 0.368394 0.054794 0.523540 -0.228286 0.012931 -0.124813 -0.238527 -0.147270 -0.057829 0.512214 0.074596 -0.039874 -0.030051 0.234347 -0.027825
polarizability: 4.35219542e+02 -1.61534991e+00 2.38813475e+02 -3.87051192e+00 -7.46045523e+00 1.35525913e+02
1716.lowfreq: -17.0075 -0.6153 0.0006 0.0008 0.0017 4.0169 8.5838 17.2464 23.9323
frequency: -16.3222 17.2091 23.7255 48.9879 54.1765 62.9150 79.5138 93.4510 105.9503 113.0810 131.3633 134.5112 166.2691 178.7921 206.8922 222.2156 232.0794 244.5128 265.1621 283.9837 305.8171 310.8173 350.0219 369.2446 373.4729 382.2086 401.3661 426.0524 431.6138 451.5398 499.6908 537.6120 556.0948 575.5400 598.8416 607.8899 630.0123 643.3717 672.4747 678.9182 696.8183 709.6577 723.4090 748.7089 777.0050 794.6074 812.6477 846.3667 855.7090 872.2883 880.3980 888.9158 894.6445 915.4862 942.9121 953.8366 968.5563 979.8866 995.8710 1011.5123 1021.7694 1025.8365 1040.6062 1052.6095 1077.6880 1092.3347 1134.0075 1139.9055 1154.9666 1213.8469 1217.7157 1220.3689 1232.7609 1254.6939 1275.6396 1283.8559 1288.0939 1295.9447 1337.6415 1339.0322 1385.5934 1391.3542 1391.8412 1401.8812 1429.3651 1448.5967 1453.5188 1469.2155 1472.0418 1475.2464 1476.8349 1478.2011 1489.7710 1496.6937 1535.2181 1565.2618 1583.9302 1598.3249 1618.7467 1636.5517 2975.8807 2980.2794 2989.7193 2999.3249 3024.2930 3050.7034 3074.7515 3078.7160 3099.2510 3103.9412 3126.9638 3136.5043 3144.1870 3159.6422 3159.9905 3199.2336 3530.0812
redmass: 1.1766 4.4090 3.3150 5.3288 6.9443 3.8998 1.7499 4.8271 5.6620 5.2931 5.7745 6.1080 5.5499 7.8415 5.2872 3.8380 1.2633 5.6296 4.8015 6.2657 4.9914 4.3112 4.9913 6.6007 4.0272 5.9213 6.9386 5.1719 4.5698 3.4602 6.9393 5.1646 4.7865 4.0224 4.5560 3.4205 6.5429 6.6586 1.3146 5.3282 4.4334 5.0177 4.0130 1.0961 4.5729 10.8265 3.8939 1.8839 3.4243 1.2500 1.5026 1.9599 1.5400 19.2735 6.8133 1.4903 3.8196 1.3744 1.6418 6.8438 1.4021 2.3503 1.6467 2.9275 1.4487 2.1482 1.8099 1.4357 1.4635 3.0853 2.4080 1.3987 1.4605 1.5907 1.5124 1.2408 2.0264 2.0372 1.5014 3.6252 6.5289 1.2078 1.2117 3.5696 5.6000 1.0462 2.6821 1.1112 1.0869 2.2501 1.0611 1.0485 1.0938 3.3581 7.3604 5.4475 7.6260 6.5776 5.9886 5.4059 1.0361 1.0592 1.0601 1.0363 1.1002 1.1034 1.1016 1.0992 1.0986 1.1002 1.0923 1.0890 1.0913 1.0909 1.0964 1.0951 1.0769
irintensity: 2.2112 2.2352 0.3566 1.4494 12.7837 0.3183 0.2606 3.6215 1.2586 0.2436 0.0870 1.0007 7.1859 0.7972 4.0510 0.5004 0.0787 1.5271 3.0679 12.8807 4.0277 9.6403 0.9504 7.2563 2.0251 8.3832 28.4264 15.8267 11.6250 11.9780 15.0959 13.6871 28.9106 10.9881 2.7865 8.1800 3.1422 7.5117 64.4336 22.0718 21.3143 37.9847 3.0888 4.6864 6.5729 72.9531 30.7245 15.8121 6.0520 1.8649 6.5771 1.5449 54.8859 84.2461 6.6962 8.9400 5.6228 1.7514 36.7850 1.3157 0.6962 7.3791 15.7999 0.4914 3.4643 32.4592 60.1757 23.6471 14.3220 127.8900 12.7621 2.0381 14.8404 76.1292 95.7831 39.3633 72.7511 217.9738 19.4572 550.7639 1.2635 79.8986 8.4927 92.9482 35.2638 16.7156 3.1518 18.4655 0.4198 97.8163 1.9625 8.9653 18.9936 250.1693 299.8019 101.1108 94.6836 17.4480 201.4591 114.3618 42.8305 3.0091 62.3048 7.5677 0.1693 6.5969 68.7485 41.0774 7.9337 12.5905 8.4376 8.9532 4.2992 3.7612 5.6283 8.0134 21.5399
temp: 298.150 k
press: 1.00000 atm
elementType: 16 8 8 8 8 7 6 6 6 6 6 6 6 6 6 6 6 6 6 6 6 6 6 6 1 1 1 1 1 1 1 1 1 1 1 1 1 1 1 1 1
symmnumber: 1
zpe: 813865.0 jmol-1
zpe.correction: 0.309985 hartree
zpe.thermalcorrener: 0.332341 hartree
zpe.thermalcorrenthalpy: 0.333285 hartree
zpe.thermalcorrgfe: 0.256619 hartree
zpe.sumelectzpe: -1447.966055 hartree
zpe.sumelectthermal: -1447.943698 hartree
zpe.sumelectthermalent: -1447.942754 hartree
zpe.sumelectthermalfe: -1448.019420 hartree
dipole: 0.2013 0.4199 -2.9183
dipole: 2.9552
quadrupole: -93.7048 -166.6297 -158.1151
quadrupole: -15.0335 -2.4607 -3.3360
quadrupole: 45.7784 -27.1465 -18.6319 -15.0335 -2.4607 -3.3360
hfenergy: -1448.2760394 hartree
pointgroup: C01 [X(C18H17N1O4S1)]
dipole: 0.0968095 -0.2351969 1.134507 debye
polarizability: 435.0957185|5.9941077|239.516128|0.8065025|-0.883474|134.9470833 unknown
InChI: InChI=1S/C18H17NO4S/c1-3-4-12-5-8-16-15(9-12)18(21)14-7-6-13(19-11(2)20)10-17(14)24(16,22)23/h5-10,19H,3-4H2,1-2H3
charge 0 multiplicity 1
41 atoms
S  0.001423 -1.897245 -0.687498
O  -0.332674 -3.163616 0.296154
O  0.06515 -2.17081 -2.29785
O  0.825144 2.549225 -0.566885
O  -6.105599 1.620008 0.189435
N  -4.921397 -0.402486 0.032041
C  1.595999 -1.0593 -0.147549
C  1.711604 0.350514 -0.17417
C  -1.246983 -0.519943 -0.364182
C  -0.839646 0.834667 -0.369018
C  0.57703 1.312344 -0.414292
C  4.102627 0.07815 0.424077
C  2.989876 0.894426 0.116474
C  2.664663 -1.908958 0.174233
C  5.472888 0.688183 0.66017
C  -2.572586 -0.933299 -0.231256
C  3.918054 -1.330555 0.467355
C  -1.881014 1.79786 -0.25556
C  -3.590253 0.053382 -0.107546
C  6.299654 0.789568 -0.655311
C  -3.230376 1.433224 -0.133431
C  7.692393 1.410466 -0.422511
C  -6.097371 0.357693 0.169357
C  -7.373709 -0.467668 0.287746
H  3.079985 1.986534 0.098531
H  2.515645 -2.99319 0.203354
H  5.371186 1.702215 1.09188
H  6.042682 0.080351 1.389729
H  -2.807046 -2.004795 -0.215645
H  4.762863 -1.978422 0.728194
H  -1.588213 2.852753 -0.258591
H  6.40514 -0.221065 -1.096573
H  5.733967 1.393669 -1.391145
H  -4.013413 2.187446 -0.045022
H  7.608959 2.433572 -0.010208
H  8.284794 0.807296 0.291047
H  8.262689 1.473129 -1.366744
H  -5.042088 -1.418181 0.031257
H  -8.038811 -0.220701 -0.557862
H  -7.902162 -0.17718 1.211577
H  -7.206774 -1.558361 0.300634
