program: Gaussian 09
title: 000153465
version: EM64L-G09RevD.01
frameworkgroup: C1[X(C7H14N2O3)]
method: RPBEPBE
basis: SDD
operation: Freq
keyword: #p
keyword: freq=noraman
keyword: PBEPBE/SDD
title: #p freq=noraman PBEPBE/SDD
converged: YES YES NO NO
title: Mulliken charges:
elementType: O O O N N C C C C C C C H H H H H H H H H H H H H H
charge: -0.321595 -0.330775 -0.378841 -0.366578 -0.305336 -0.177555 -0.364709 0.286670 -0.704401 -0.697280 -0.473510 0.269895 0.195871 0.205000 0.231789 0.243342 0.217718 0.221630 0.224520 0.201935 0.229213 0.315143 0.263271 0.248471 0.392894 0.373218
chargesum: 0.00000
title: Mulliken charges with hydrogens summed into heavy atoms:
elementType: O O O N N C C C C C C C
charge: -0.321595 -0.330775 -0.005623 -0.051435 0.087559 0.018316 0.072080 0.286670 -0.021711 -0.041612 0.038232 0.269895
polarizability: 1.21940376e+02 -1.82150392e-01 9.87244026e+01 4.07831505e+00 -8.36782035e+00 8.29712093e+01
1716.lowfreq: -17.2995 -11.3429 -5.9837 -0.0006 -0.0003 0.0005 15.7639 42.7450 62.9283
frequency: 14.5920 42.6953 62.9198 84.8970 123.1760 158.5160 180.5587 187.0837 216.9969 233.0787 249.2736 273.9093 304.0785 312.5259 367.5406 421.9884 456.5110 495.0464 544.9145 593.8116 623.5121 712.5947 719.3802 749.2026 789.3934 817.9063 856.1831 911.1415 955.6376 961.2275 999.9161 1022.3816 1033.7704 1054.2246 1094.5909 1103.5377 1165.5742 1205.4993 1236.3400 1255.8208 1262.2918 1271.3371 1326.1585 1332.3744 1353.4121 1357.4928 1386.5087 1392.6971 1433.6765 1458.8666 1471.7408 1475.3525 1479.5045 1481.9600 1484.1959 1497.3021 1572.5568 1599.1597 2963.1799 2974.8966 2986.0892 2989.9544 3021.0484 3043.1168 3073.0808 3078.7054 3082.7050 3094.8271 3116.8701 3274.9027 3368.1068 3560.2361
redmass: 4.0748 4.2885 6.6735 2.6871 3.6056 3.5531 3.0962 3.9979 1.0684 1.5672 2.6260 3.0600 4.8863 4.4456 2.9651 3.1403 1.8194 1.6487 1.1965 3.6063 2.7226 5.3368 2.0418 1.4588 1.9490 1.8190 2.1184 3.7948 2.1818 1.5711 2.3035 1.8248 3.5238 3.5676 2.1287 1.7664 2.2583 1.5923 1.7510 1.3619 1.3238 1.2335 1.3974 1.2886 1.5280 1.6598 1.1954 1.2146 1.1521 1.0754 1.0862 1.4087 1.0767 1.0695 1.2524 1.7211 6.4035 4.5022 1.0827 1.0365 1.0367 1.0596 1.0635 1.1005 1.1008 1.0995 1.1002 1.1004 1.1002 1.0639 1.0891 1.0786
irintensity: 0.5955 1.6710 2.3794 0.8585 5.6145 8.1306 1.1074 1.3714 0.1481 8.0104 17.9011 0.2200 9.0141 6.7266 25.2765 0.5592 35.6980 90.6447 88.1879 46.8250 4.7681 7.5917 81.4625 128.3386 4.1779 1.5480 1.8470 65.9858 10.2470 11.6234 9.3405 32.9897 36.4804 3.2085 7.3968 6.1648 0.7178 9.6448 60.8141 16.5210 32.9497 5.6215 3.9436 1.7610 14.0180 157.7401 6.3452 17.3215 20.5555 3.3628 37.1046 43.6970 13.3102 13.3842 61.1325 48.8967 122.7766 192.9546 26.2700 32.6062 16.3678 40.9289 14.9732 0.8389 49.5473 37.8650 46.4656 25.6566 3.4578 10.3116 302.3790 25.8837
temp: 298.150 k
press: 1.00000 atm
elementType: 8 8 8 7 7 6 6 6 6 6 6 6 1 1 1 1 1 1 1 1 1 1 1 1 1 1
symmnumber: 1
zpe: 561385.1 jmol-1
zpe.correction: 0.213820 hartree
zpe.thermalcorrener: 0.227947 hartree
zpe.thermalcorrenthalpy: 0.228891 hartree
zpe.thermalcorrgfe: 0.171484 hartree
zpe.sumelectzpe: -609.333188 hartree
zpe.sumelectthermal: -609.319062 hartree
zpe.sumelectthermalent: -609.318117 hartree
zpe.sumelectthermalfe: -609.375524 hartree
dipole: -4.6591 -1.8466 1.8840
dipole: 5.3541
quadrupole: -81.4710 -72.0050 -74.0025
quadrupole: 0.3271 -4.8509 2.2906
quadrupole: -5.6448 3.8212 1.8236 0.3271 -4.8509 2.2906
hfenergy: -609.5470085 hartree
pointgroup: C01 [X(C7H14N2O3)]
dipole: 1.8779121 -0.173366 0.9384183 debye
dipolederiv: -0.8220942 0.1558033 -0.1294171 0.097562 -0.4906106 0.2206585 0.0271023 0.0889704 -0.8292452 -0.8639444 -0.0542327 0.4417013 -0.1959779 -0.3919856 0.1460975 0.1281042 -0.0283889 -0.7578204 -0.5372417 -0.0235923 -0.3398958 -0.1080905 -0.3620345 -0.1559662 -0.1533447 -0.0260265 -0.2933032 -0.7120854 -0.0041021 0.2166958 0.0169109 -0.393825 -0.1500953 0.2630392 -0.143145 -0.7234619 -0.127373 0.1420654 0.3239394 0.1657185 -0.229387 0.2299951 0.2866794 0.0825959 -0.5507968 -0.1226087 0.0626956 0.0416253 0.0873012 -0.0373712 -0.0642262 0.0877453 -0.0886975 0.1028627 0.1742676 -0.017352 0.0112445 0.084612 0.0680387 -0.0247927 -0.0445119 -0.0023135 0.072733 0.8840681 -0.3275495 -0.2351652 -0.3676981 0.3518003 -0.1163895 -0.3453976 -0.028782 1.1888298 -0.0350393 0.0053838 -0.0029226 -0.0343552 0.018981 -0.0417532 -0.0615956 0.0134661 0.0348194 0.0248499 -0.0600596 -0.0076951 -0.0687129 -0.0281886 -0.0660388 0.0125747 -0.0574998 0.0552223 0.2974897 -0.1134704 -0.0020405 -0.1976656 0.3110247 0.0428097 -0.0313277 -0.0205132 0.1677861 0.7703819 0.1576496 -0.4457867 0.2782924 0.1126276 -0.1480956 -0.3255082 -0.0138295 1.0734462 0.0151795 0.0065162 -0.004478 0.0215624 0.0243509 0.0237798 -0.0182286 0.0569562 -0.1912763 -0.1258325 0.1042539 0.0345675 0.1048231 -0.060061 -0.03534 0.0238142 -0.027067 0.0749595 0.0847867 -0.0056047 -0.0707604 -0.0342693 0.0424065 0.0368678 -0.0167716 0.0341214 -0.1047827 0.1074597 0.00031 -0.0381822 -0.0027571 0.0665775 0.0918538 -0.02994 0.015449 -0.075027 -0.0893207 0.1420535 0.01036 0.1232754 -0.0057416 -0.027215 0.0073007 -0.0281189 0.0849557 -0.0464367 -0.1428454 0.0433689 -0.1143826 -0.0117036 0.0096456 0.0606716 0.0395808 0.0517382 -0.1065759 -0.1354611 0.0465074 -0.1299819 0.0082244 0.0164644 0.0718345 0.032375 0.0671307 0.0911081 0.0058695 -0.0229303 0.0274339 0.0331447 0.0966594 -0.0652814 0.0374939 -0.1528835 -0.0424514 0.1490506 0.0152638 0.1292767 -0.0181789 -0.0282154 -0.0029589 -0.0203513 0.062345 0.1730439 0.0923893 0.0014872 0.1079872 0.2189335 0.0471509 -0.0109115 0.0380937 0.1851025 0.0009425 -0.0497426 -0.0035538 0.0095125 -0.0250099 0.0082829 -0.0113711 0.1178513 0.0716323 0.0300969 0.02117 0.0135456 0.0189144 0.1132245 -0.0081316 0.0146228 -0.0508465 -0.0493834 0.6501214 -0.0876067 0.039157 -0.01124 0.31932 -0.0920828 -0.0448567 -0.05582 0.2361875 0.3272078 -0.0235914 0.0633641 -0.0080513 0.3654431 -0.0119229 0.1785166 0.0344458 0.1982295 unknown
polarizability: 121.8162884|1.3399961|81.2476706|-3.6029872|6.6662479|100.5720287 unknown
InChI: InChI=1S/C7H14N2O3/c1-3-5(2)7(11)8-4-6(10)9-12/h5,8-9,12H,3-4H2,1-2H3
charge 0 multiplicity 1
26 atoms
O  0.329825 0.62964 -1.122001
O  -3.3946 0.155675 1.373918
O  -3.524885 -0.258039 -1.283607
N  0.095663 0.265832 1.152038
N  -2.378189 0.361633 -0.678143
C  2.016082 -0.788082 -0.021484
C  3.24349 0.043498 -0.49072
C  0.759078 0.08799 -0.045145
C  1.794625 -2.022438 -0.93315
C  3.592854 1.221816 0.442689
C  -1.096308 1.130538 1.262486
C  -2.374176 0.50432 0.678373
H  2.202732 -1.131378 1.018117
H  4.109145 -0.642717 -0.569202
H  3.031973 0.419015 -1.509886
H  1.582219 -1.693964 -1.965454
H  2.700398 -2.654895 -0.944907
H  0.946189 -2.641201 -0.588971
H  4.488885 1.756879 0.080267
H  3.803423 0.872789 1.471804
H  2.766489 1.954555 0.492452
H  0.421342 -0.230459 1.982769
H  -0.884538 2.084921 0.746933
H  -1.295793 1.33007 2.326317
H  -1.560229 0.504532 -1.29407
H  -4.124993 -0.386231 -0.480023
