program: Gaussian 09
title: 000153455
version: EM64L-G09RevD.01
frameworkgroup: C1[X(C13H13Cl3N2O2)]
method: RPBEPBE
basis: SDD
operation: Freq
keyword: #p
keyword: freq=noraman
keyword: PBEPBE/SDD
title: #p freq=noraman PBEPBE/SDD
converged: YES YES NO NO
title: Mulliken charges:
elementType: Cl Cl Cl O O N N C C C C C C C C C C C C C H H H H H H H H H H H H H
charge: -0.051211 -0.053824 -0.033443 -0.162394 -0.123661 -0.111354 -0.233374 -0.423421 0.328628 -0.326685 -0.322980 0.183312 0.057151 -0.045416 -0.286507 -0.579507 -0.582450 -0.306559 -0.175213 -0.133216 0.243877 0.267502 0.239729 0.246920 0.239330 0.261748 0.262929 0.253565 0.271218 0.261826 0.274294 0.296790 0.262396
chargesum: 0.00000
title: Mulliken charges with hydrogens summed into heavy atoms:
elementType: Cl Cl Cl O O N N C C C C C C C C C C C C C
charge: -0.051211 -0.053824 -0.033443 -0.162394 -0.123661 -0.111354 -0.233374 0.087959 0.328628 0.159964 0.178098 0.183312 0.057151 -0.045416 -0.023578 -0.054724 -0.046330 -0.009769 0.087183 -0.133216
polarizability: 2.27915228e+02 1.16172632e+00 2.15299698e+02 -2.46880558e+01 2.63390260e+01 1.38747544e+02
1716.lowfreq: -5.4264 -2.6691 -0.0006 0.0019 0.0023 5.5201 12.8517 22.9384 31.0532
frequency: 12.5835 22.9362 31.0379 33.1589 63.5562 76.0418 83.0641 84.9695 110.9012 133.6983 145.0105 172.8373 192.3857 214.3058 228.2224 246.5936 297.3446 306.6256 330.9482 350.9868 366.7317 368.3391 399.3355 425.3163 460.4250 473.1674 524.9031 552.2209 573.0768 642.1137 676.2776 681.8952 696.7888 708.1363 723.5519 775.2743 780.8856 801.0937 816.1629 826.4918 859.7804 912.0019 939.5572 945.9970 990.4219 1003.1420 1017.4348 1042.6084 1057.0522 1062.6475 1066.1169 1090.9177 1107.2024 1128.7030 1166.1962 1177.8805 1210.9148 1228.4030 1252.0940 1255.7475 1267.6843 1286.5470 1301.2405 1312.1977 1326.4057 1366.6260 1373.9995 1385.0486 1407.9468 1430.3514 1453.5477 1454.9864 1458.5510 1472.3733 1479.2804 1481.4751 1589.8018 1614.4158 1652.7473 1663.8847 2940.2982 2949.4946 2953.8955 3026.0246 3052.2991 3055.6028 3062.6054 3071.0182 3141.1322 3145.0028 3165.1786 3173.7224 3191.4097
redmass: 14.7434 9.2564 8.9887 10.7242 4.5119 2.8532 8.9173 3.0472 5.3149 4.8394 6.5861 8.7910 4.7394 10.3120 3.6213 4.1665 6.4856 5.1844 5.6974 8.3966 5.9610 4.1803 4.0126 4.0666 4.2933 3.8195 7.5752 4.3965 8.1306 6.4518 6.5725 6.0399 6.8505 5.4459 6.0472 1.1416 1.1525 6.0456 1.7821 3.1192 4.3192 1.4769 4.9772 1.3742 1.9712 1.5070 3.4696 3.0869 2.1030 3.1753 2.4545 1.8880 2.2166 1.7220 1.8596 2.4246 2.2137 1.6522 1.1725 1.2713 1.3892 1.1395 1.6527 1.7063 1.9321 1.3145 1.3670 3.8102 1.4151 4.6098 1.3164 1.1579 1.7726 1.1155 1.0883 1.0862 8.6316 8.4853 11.7760 12.0102 1.0649 1.0689 1.0688 1.0962 1.0610 1.0595 1.0893 1.0915 1.1115 1.1113 1.0902 1.0937 1.0954
irintensity: 0.4305 2.2612 0.8527 1.3742 0.6612 1.5928 1.7202 1.7291 1.5286 0.4680 0.8584 3.9460 6.4529 2.0090 0.6713 3.4387 1.6799 1.7471 2.6307 2.4493 2.0154 12.5040 1.6144 3.1214 16.9997 18.5440 10.9854 4.1540 15.9594 5.2529 39.0473 102.0130 17.7127 15.6269 30.6568 7.0722 7.6268 1.3432 29.1568 31.1420 3.0764 11.0712 6.0638 0.5609 35.1899 5.5863 23.2907 17.1521 23.8608 3.5368 42.8186 51.0751 49.0608 12.0231 23.6247 54.1069 48.2609 28.9806 18.5994 16.9202 41.4072 8.9598 75.8125 17.6876 12.2602 1.2508 1.2943 51.0981 6.0469 51.3026 58.7573 13.1992 156.0541 60.9303 6.8598 4.7861 55.6250 262.3850 233.5662 42.5296 22.0828 27.1605 62.0729 13.0299 25.4527 16.0530 14.7075 11.1917 17.0059 19.1239 1.0742 1.3729 2.6937
temp: 298.150 k
press: 1.00000 atm
elementType: 17 17 17 8 8 7 7 6 6 6 6 6 6 6 6 6 6 6 6 6 1 1 1 1 1 1 1 1 1 1 1 1 1
symmnumber: 1
zpe: 631813.7 jmol-1
zpe.correction: 0.240645 hartree
zpe.thermalcorrener: 0.260686 hartree
zpe.thermalcorrenthalpy: 0.261630 hartree
zpe.thermalcorrgfe: 0.187274 hartree
zpe.sumelectzpe: -2141.831456 hartree
zpe.sumelectthermal: -2141.811415 hartree
zpe.sumelectthermalent: -2141.810471 hartree
zpe.sumelectthermalfe: -2141.884827 hartree
dipole: 1.4984 4.6824 -0.2118
dipole: 4.9208
quadrupole: -152.6804 -162.1206 -145.7301
quadrupole: -9.6839 -5.6729 -3.0436
quadrupole: 0.8299 -8.6102 7.7803 -9.6839 -5.6729 -3.0436
hfenergy: -2142.0721011 hartree
pointgroup: C01 [X(C13H13Cl3N2O2)]
dipole: -0.6692994 -1.6939534 -0.6562473 debye
polarizability: 228.6142151|-6.9727606|223.9213136|21.1955681|1.8828015|129.4269414 unknown
InChI: InChI=1S/C13H13Cl3N2O2/c14-3-5-17(6-4-15)8-18-11-2-1-9(16)7-10(11)12(19)13(18)20/h1-2,7H,3-6,8H2
charge 0 multiplicity 1
33 atoms
Cl -4.857164 -2.804494 -1.296825
Cl -2.585339 1.470626 3.834519
Cl 4.440364 -3.019511 0.688823
O  0.153505 3.184227 -0.991431
O  3.060465 2.650017 -0.20247
N  -2.217426 0.164391 -0.07991
N  0.036627 0.817774 -0.788522
C  -1.364428 0.653849 -1.183775
C  0.944646 -0.22608 -0.445985
C  -3.469446 -0.489737 -0.534374
C  -2.363648 1.095008 1.066877
C  2.237364 0.313596 -0.176841
C  0.680996 2.076598 -0.744734
C  2.170473 1.780547 -0.337606
C  0.711574 -1.609336 -0.364507
C  -3.252886 -2.000646 -0.704445
C  -2.332451 0.296528 2.377177
C  3.321515 -0.51293 0.17297
C  1.801906 -2.447442 -0.017328
C  3.077544 -1.898369 0.244522
H  -1.430206 -0.07302 -2.015066
H  -1.680281 1.650323 -1.564661
H  -3.850907 -0.0590 -1.485554
H  -4.257197 -0.3255 0.221361
H  -3.299466 1.691633 1.008099
H  -1.524807 1.811614 1.062668
H  -0.276764 -2.038305 -0.539782
H  -2.506827 -2.239683 -1.478157
H  -2.99665 -2.487185 0.247868
H  -3.149864 -0.437452 2.448074
H  -1.35993 -0.19086 2.535147
H  4.307773 -0.085992 0.375958
H  1.655236 -3.529489 0.053907
