program: Gaussian 09
title: 000153443
version: EM64L-G09RevD.01
frameworkgroup: C1[X(C7H13NO2)]
method: RPBEPBE
basis: SDD
operation: Freq
keyword: #p
keyword: freq=noraman
keyword: PBEPBE/SDD
title: #p freq=noraman PBEPBE/SDD
converged: YES YES NO NO
title: Mulliken charges:
elementType: O O N C C C C C C C H H H H H H H H H H H H H
charge: -0.419110 -0.232866 -0.569319 -0.427402 -0.168635 -0.519265 0.531685 0.139376 -0.820382 -0.739006 0.212805 0.226295 0.268531 0.203537 0.245811 0.278242 0.281742 0.226799 0.221807 0.234097 0.229388 0.218133 0.377735
chargesum: 0.00000
title: Mulliken charges with hydrogens summed into heavy atoms:
elementType: O O N C C C C C C C
charge: -0.041375 -0.232866 -0.009334 0.011697 0.099897 -0.069917 0.531685 0.139376 -0.137679 -0.291485
polarizability: 9.75537174e+01 6.53658226e-01 9.03115021e+01 8.11542134e+00 5.31690155e+00 7.86824932e+01
1716.lowfreq: -16.7862 -0.0007 -0.0003 0.0005 7.2048 9.5541 26.0725 38.7899 47.4748
frequency: 25.5005 38.7268 47.3319 83.6920 162.2270 178.7435 202.4294 224.9906 260.4616 336.5175 370.1239 389.0259 418.6832 478.0465 547.1870 575.7184 605.7385 681.8655 683.5252 713.1144 753.5787 804.9452 892.2419 923.4351 942.8822 956.5277 982.3751 1015.8389 1029.7436 1043.3433 1055.5789 1125.5256 1145.2043 1195.8511 1225.0927 1270.6672 1290.6198 1292.9539 1324.4973 1337.6969 1370.3815 1391.2633 1424.0014 1453.1433 1460.2178 1471.4983 1479.1134 1651.6955 1654.9772 1665.1404 2963.7526 2969.7697 2992.6591 3024.6381 3037.5590 3053.4398 3069.2070 3083.4036 3085.3406 3189.7495 3448.6899 3501.9937 3570.8134
redmass: 2.9381 6.7056 4.7920 3.4098 1.5843 1.8605 1.1819 2.5915 3.2804 2.9765 2.8366 2.0483 2.0972 2.9011 2.4686 1.6089 2.1954 2.4127 1.6349 1.2426 2.4329 2.7610 2.8878 2.2237 1.3471 1.5886 1.5778 1.6597 2.7258 1.5143 2.0612 1.4123 1.9198 1.3474 1.4151 1.6916 1.5918 2.0829 1.2976 1.5288 1.3712 1.2384 1.1637 1.0756 1.0871 1.0655 1.0735 1.2478 4.3465 4.9611 1.0385 1.0628 1.0632 1.0834 1.0968 1.0984 1.0975 1.0981 1.0625 1.1141 1.0455 1.0641 1.0964
irintensity: 0.0310 0.7932 0.8303 0.4523 0.7843 1.2213 33.0106 0.4973 11.8217 1.8419 20.9667 2.4925 0.8496 23.4444 9.0368 87.1788 36.2689 61.9218 218.5957 7.3160 4.2875 4.7456 7.5429 11.4357 64.8497 25.0658 7.0615 7.3414 209.2995 9.8414 15.6684 9.1273 10.0370 7.6100 4.1657 7.6098 25.1890 10.8195 1.1428 0.4780 1.7219 23.9324 2.3741 3.1907 17.3749 27.0254 9.0642 5.3781 284.5974 21.7033 23.9120 30.5693 41.0753 10.2780 24.5679 10.5782 33.8324 28.6295 6.4314 24.4925 1.2848 11.3698 4.7042
temp: 298.150 k
press: 1.00000 atm
elementType: 8 8 7 6 6 6 6 6 6 6 1 1 1 1 1 1 1 1 1 1 1 1 1
symmnumber: 1
zpe: 506287.7 jmol-1
zpe.correction: 0.192835 hartree
zpe.thermalcorrener: 0.204943 hartree
zpe.thermalcorrenthalpy: 0.205887 hartree
zpe.thermalcorrgfe: 0.153194 hartree
zpe.sumelectzpe: -478.923340 hartree
zpe.sumelectthermal: -478.911231 hartree
zpe.sumelectthermalent: -478.910287 hartree
zpe.sumelectthermalfe: -478.962981 hartree
dipole: -0.1953 1.1491 -0.0984
dipole: 1.1697
quadrupole: -68.1052 -57.3174 -58.1681
quadrupole: 1.2928 -1.5982 1.1963
quadrupole: -6.9083 3.8795 3.0288 1.2928 -1.5982 1.1963
hfenergy: -479.1161745 hartree
pointgroup: C01 [X(C7H13N1O2)]
dipole: -0.0597218 -0.4443417 0.1037952 debye
dipolederiv: -0.2988331 -0.0018641 -0.0193344 -0.0540949 -1.1180313 0.3024813 -0.0200514 0.2911226 -0.5053994 -1.0518275 -0.2285539 0.113155 -0.0040291 -0.6142655 0.1163116 0.1009009 0.1465603 -0.353178 -0.5642435 0.1262822 -0.1090593 0.1108093 -0.6865764 0.0248581 -0.134236 0.0749354 -0.2030811 0.0560525 0.029676 -0.0251767 0.1193098 0.0472212 0.0465645 0.0897916 -0.0972638 0.0984865 -0.0647495 0.1234247 -0.016771 -0.0190334 0.5355953 0.0113777 -0.0173381 0.0385166 0.1183724 0.0412773 0.0076884 0.0506666 -0.0744441 0.0098229 -0.0301906 -0.0200222 0.0619369 0.0522961 -0.0256939 0.0466834 -0.1523532 0.1035473 0.3115019 0.055367 -0.213814 0.0456238 0.1614131 1.3044674 0.1607608 -0.105816 -0.0631451 1.1771609 -0.4612738 -0.1328989 -0.4615312 0.309271 0.0508598 -0.0044806 0.0440404 -0.0510091 -0.1618058 0.0229552 0.063391 0.0003306 0.0320424 -0.386769 0.1127345 -0.1608371 0.0827111 -0.1078413 -0.0865458 -0.148843 -0.0974156 -0.2155068 -0.0632677 -0.0343439 0.1224252 -0.0463882 0.0621801 0.0635585 0.0705132 0.0329251 -0.1009843 0.0749221 -0.0057082 -0.0283465 0.0166997 -0.1424513 -0.0207781 -0.0245804 0.0133686 0.0754776 0.1609081 -0.0134456 0.0657442 0.0140268 0.0110514 0.0225563 0.0510188 0.034502 -0.0423925 -0.0561324 -0.0226736 -0.0879393 -0.0466 0.0683015 -0.0748438 -0.0643107 -0.0568109 -0.1330857 0.0894669 0.0051727 0.0390957 0.032959 -0.1054163 0.0515436 0.0586471 -0.0103796 0.0716964 0.1865742 -0.1292159 0.1385889 -0.0237876 0.2128105 -0.0594565 0.1113473 -0.0355327 0.1557523 0.2261197 -0.1431241 -0.0744187 -0.0698395 0.1815143 -0.0101144 -0.0451193 -0.0528141 0.0569922 -0.0024996 -0.0743344 0.1117947 -0.0227017 0.0571622 0.0143649 0.1409803 0.0792612 -0.0507629 0.0681437 -0.0658793 -0.0802061 -0.0166402 0.0279474 -0.0525127 -0.1116957 -0.0913072 -0.0908766 -0.0685984 0.1253347 -0.0237834 0.1051361 0.0026615 -0.0229347 -0.0135047 0.0082747 0.106257 0.1662534 -0.0646531 0.048285 -0.0535016 -0.1073131 0.0008941 0.0532572 0.0231408 0.0997206 0.0890008 -0.0433549 0.1437842 -0.0709453 0.0520638 0.0662994 0.1617986 0.0344084 -0.0159981 0.068569 0.0938743 0.0064618 0.0309606 0.2867058 0.0195183 0.0447684 0.0181481 0.3734876 unknown
polarizability: 97.513658|-1.5581596|91.4584809|-8.2590473|3.1723141|77.5755738 unknown
InChI: InChI=1S/C7H13NO2/c1-5(2)3-4-6(8)7(9)10/h6,9H,1,3-4,8H2,2H3
charge 0 multiplicity 1
23 atoms
O  1.96325 -1.606845 0.692943
O  3.267253 0.149979 -0.089365
N  0.959532 1.8976 -0.038494
C  -0.006851 -0.135737 -1.105649
C  0.798183 0.445989 0.095205
C  -1.473942 0.37335 -1.106376
C  -2.292856 -0.12043 0.081256
C  2.138975 -0.299018 0.21172
C  -2.562963 -1.614382 0.155026
C  -2.756108 0.740125 1.028514
H  0.488217 0.174442 -2.047328
H  0.025166 -1.23984 -1.065414
H  0.217057 0.236631 1.012843
H  -1.95266 0.033707 -2.048429
H  -1.449922 1.477135 -1.115761
H  1.623565 2.157003 -0.777601
H  1.185586 2.372689 0.84107
H  -3.215433 -1.86832 1.007979
H  -3.050409 -1.972291 -0.773297
H  -1.623412 -2.190572 0.264326
H  -2.555386 1.8163 0.967577
H  -3.352134 0.392937 1.881339
H  2.845491 -2.06745 0.733016
