program: Gaussian 09
title: 000153426
version: EM64L-G09RevD.01
frameworkgroup: C1[X(C14H6Cl2N2O4)]
method: RPBEPBE
basis: SDD
operation: Freq
keyword: #p
keyword: freq=noraman
keyword: PBEPBE/SDD
title: #p freq=noraman PBEPBE/SDD
converged: YES YES YES YES
title: Mulliken charges:
elementType: Cl Cl O O O O N N C C C C C C C C C C C C C C H H H H H H
charge: -0.017980 -0.017975 -0.369370 -0.369321 -0.305855 -0.305828 -0.214577 -0.214663 0.156224 0.156239 0.267111 0.267107 0.209049 0.209029 0.075102 0.075053 -0.331146 -0.331132 -0.371777 -0.371774 -0.100533 -0.100552 0.311364 0.311363 0.300085 0.300082 0.392353 0.392321
chargesum: 0.00000
title: Mulliken charges with hydrogens summed into heavy atoms:
elementType: Cl Cl O O O O N N C C C C C C C C C C C C C C
charge: -0.017980 -0.017975 0.022982 0.023001 -0.305855 -0.305828 -0.214577 -0.214663 0.156224 0.156239 0.267111 0.267107 0.209049 0.209029 0.075102 0.075053 -0.019782 -0.019769 -0.071692 -0.071692 -0.100533 -0.100552
polarizability: 3.70182943e+02 -1.35069176e+01 2.50744138e+02 -3.65939734e-04 1.41463719e-03 7.02803281e+01
1716.lowfreq: -4.0104 -2.3764 -0.0020 0.0011 0.0013 3.1826 39.5033 94.8389 96.5214
frequency: 39.5033 94.8372 96.5214 97.4501 137.4517 167.1849 172.4978 173.5802 220.2141 227.4350 255.7883 256.2892 291.4983 326.1603 334.6609 334.8114 351.2429 373.3538 376.6493 384.3429 400.2425 404.2744 489.3457 528.3755 530.1917 545.8267 564.4552 570.6102 582.3091 586.1139 596.9625 673.4132 674.7013 695.7979 718.9521 724.4031 729.8888 758.6994 815.9318 817.5238 885.1475 885.2071 899.0267 901.4337 929.8148 980.4814 991.9249 1075.1222 1075.9919 1087.2176 1107.0619 1166.9705 1229.2522 1230.9741 1237.5382 1284.9096 1309.6506 1313.6791 1385.4391 1394.3251 1409.6468 1421.8528 1424.5403 1485.8551 1492.3170 1499.9805 1553.5909 1561.0208 1572.8372 1606.0619 1607.2154 1612.4926 3151.5553 3152.0590 3182.7755 3182.8788 3202.2164 3202.2281
redmass: 19.7117 14.0589 10.9423 9.4364 21.5871 6.2124 14.9257 10.6092 7.5963 4.8732 8.7823 20.5037 6.1770 6.3040 7.1863 9.6059 8.3868 15.2430 9.9022 6.2236 9.1341 11.2304 4.7124 4.0880 8.9943 8.5598 3.0668 1.2809 1.4797 3.9248 7.8060 7.2387 4.7083 5.1717 7.0511 10.7846 5.1128 7.2643 11.4685 8.0818 1.4652 1.4368 1.4115 1.4012 8.9255 10.1646 7.4586 2.5357 1.9029 6.0256 2.3858 2.8260 2.1620 2.0960 2.3591 2.8495 3.6340 3.3853 2.5544 10.4647 2.9194 3.2829 11.6620 5.1511 3.2314 3.4459 7.8589 6.6674 7.2438 9.7155 6.7826 7.0349 1.0634 1.0634 1.0932 1.0932 1.0932 1.0932
irintensity: 0.0648 0.0004 1.1767 0.0029 0.1198 0.0000 0.0000 0.0000 0.9713 0.2984 4.5384 0.0003 0.0000 0.0013 61.4818 1.9294 0.0000 14.7702 0.0000 4.9586 0.0000 0.0000 3.5135 0.0005 3.2711 8.4449 117.2484 0.0005 154.2150 0.0003 0.0000 0.0000 1.3961 0.0000 0.0001 139.0188 64.9972 0.0000 33.3572 0.0005 83.3888 0.0263 11.3298 0.0000 73.7066 0.0000 5.5399 49.7658 0.0001 0.0000 123.9281 23.2751 0.0009 77.3817 0.0000 0.0006 0.0015 289.8633 88.6312 140.4159 0.0000 185.5369 0.0004 0.0125 362.1551 0.0096 2.0676 0.0044 651.1576 0.0050 71.4827 0.0001 81.4776 40.0946 0.0677 14.3013 8.4304 4.2895
temp: 298.150 k
press: 1.00000 atm
elementType: 17 17 8 8 8 8 7 7 6 6 6 6 6 6 6 6 6 6 6 6 6 6 1 1 1 1 1 1
symmnumber: 1
zpe: 459436.5 jmol-1
zpe.correction: 0.174990 hartree
zpe.thermalcorrener: 0.192162 hartree
zpe.thermalcorrenthalpy: 0.193106 hartree
zpe.thermalcorrgfe: 0.130439 hartree
zpe.sumelectzpe: -1866.083908 hartree
zpe.sumelectthermal: -1866.066737 hartree
zpe.sumelectthermalent: -1866.065792 hartree
zpe.sumelectthermalfe: -1866.128460 hartree
dipole: 0.0000 0.0009 -0.0008
dipole: 0.0012
quadrupole: -148.3969 -145.6580 -139.8315
quadrupole: 7.8416 0.0012 -0.0001
quadrupole: -3.7681 -1.0292 4.7973 7.8416 0.0012 -0.0001
hfenergy: -1866.2588986 hartree
pointgroup: C01 [X(C14H6Cl2N2O4)]
dipole: 0.0000045 0.0003384 -0.0003253 debye
polarizability: 370.0146372|-14.2306909|250.9099319|0.1545998|0.6542356|70.2828401 unknown
InChI: InChI=1S/C14H6Cl2N2O4/c15-5-1-7-11-9(3-5)18(22)14(20)8-2-6(16)4-10(12(8)11)17(21)13(7)19/h1-4,21-22H
charge 0 multiplicity 1
28 atoms
Cl 5.343557 -0.151373 0.069202
Cl -5.346083 0.147646 0.062919
O  1.50668 3.584824 0.080674
O  -1.509249 -3.588492 0.052367
O  1.089701 -3.728422 0.053273
O  -1.092143 3.724687 0.079272
N  0.758489 2.367453 0.075965
N  -0.761026 -2.371186 0.057594
C  0.717424 -0.032204 0.067013
C  -0.719944 0.028453 0.06625
C  1.483277 1.177103 0.071946
C  -1.485808 -1.180843 0.061241
C  1.410715 -1.280188 0.062854
C  -1.413237 1.276432 0.070253
C  0.636886 -2.531051 0.057715
C  -0.639419 2.527325 0.075231
C  2.895041 1.148656 0.072763
C  -2.897572 -1.152403 0.060231
C  2.823645 -1.326764 0.063485
C  -2.826164 1.323014 0.069316
C  3.529551 -0.109861 0.068432
C  -3.532083 0.106116 0.064305
H  3.464694 2.07929 0.076669
H  -3.467213 -2.083046 0.056382
H  3.33232 -2.294008 0.060106
H  -3.334829 2.290266 0.072339
H  0.749374 4.266891 0.082303
H  -0.751684 -4.270314 0.049901
