program: Gaussian 09
title: 000153422
version: EM64L-G09RevD.01
frameworkgroup: C1[X(C22H26N2O2S2)]
method: RPBEPBE
basis: SDD
operation: Freq
keyword: #p
keyword: freq=noraman
keyword: PBEPBE/SDD
title: #p freq=noraman PBEPBE/SDD
converged: YES YES NO NO
title: Mulliken charges:
elementType: S S O O N N C C C C C C C C C C C C C C C C C C C C C C H H H H H H H H H H H H H H H H H H H H H H H H H H
charge: 0.228527 0.228526 -0.219427 -0.219448 -0.088632 -0.088641 0.322465 0.322404 0.273931 0.273835 -0.176208 -0.176404 -0.357148 -0.357285 -0.402223 -0.402182 -0.243935 -0.243870 -0.628387 -0.628331 -0.231209 -0.231193 -0.320206 -0.320147 -0.614924 -0.615007 -0.614922 -0.614984 0.296147 0.296137 0.261135 0.261181 0.302504 0.267116 0.302512 0.267092 0.192059 0.222551 0.192040 0.222546 0.242294 0.242297 0.227934 0.190470 0.223479 0.224466 0.190637 0.231740 0.227931 0.190471 0.223470 0.224440 0.190627 0.231750
chargesum: 0.00000
title: Mulliken charges with hydrogens summed into heavy atoms:
elementType: S S O O N N C C C C C C C C C C C C C C C C C C C C C C
charge: 0.228527 0.228526 -0.219427 -0.219448 -0.088632 -0.088641 0.322465 0.322404 0.273931 0.273835 -0.176208 -0.176404 -0.357148 -0.357285 -0.106076 -0.106046 0.017200 0.017311 -0.058767 -0.058727 0.011084 0.011104 0.094404 0.094439 0.026959 0.031837 0.026950 0.031833
polarizability: 5.19344178e+02 1.37402134e+01 3.44948566e+02 4.58216687e-03 3.65854931e-01 2.25807050e+02
1716.lowfreq: -0.0016 -0.0004 0.0016 5.4876 5.8387 7.8552 14.6387 16.6664 23.8461
frequency: 14.5927 16.5549 23.7040 26.9299 30.6529 37.1807 49.4291 78.6023 87.5291 92.8954 99.1980 120.6625 131.2371 136.2194 152.8232 174.5939 189.6277 195.7361 202.3309 213.7737 221.4046 222.2041 231.3290 232.3427 243.9128 267.3455 279.7598 328.2016 332.5660 347.9615 351.5255 361.2097 390.2258 390.4958 395.3974 422.9460 423.0424 428.9377 441.1261 445.5677 467.8410 475.9317 490.8441 517.4866 533.2413 608.3295 656.0820 674.5946 689.3412 689.5756 696.7031 715.3627 755.7614 773.7697 783.9606 787.5216 793.0090 799.0529 816.9861 817.8147 826.2174 879.9593 905.4973 949.9244 955.2046 958.3728 999.0049 999.2971 1005.1365 1005.3215 1022.7974 1022.8896 1035.7672 1035.9496 1064.0035 1064.3908 1067.0490 1079.8387 1090.5436 1090.6382 1112.9993 1113.9836 1117.0199 1117.8877 1142.9867 1143.1257 1162.9365 1179.8949 1187.5568 1206.7492 1219.6546 1220.0002 1240.2041 1240.7803 1266.4958 1266.8302 1277.1664 1283.2901 1304.7485 1304.8635 1364.7456 1365.0582 1369.9492 1382.0783 1409.6809 1415.3737 1420.9999 1421.3304 1421.4165 1432.9331 1441.9904 1442.1455 1452.3757 1452.4732 1462.8131 1462.9255 1467.3927 1467.4312 1477.2423 1477.2904 1479.6168 1479.8352 1486.3504 1486.3533 1515.8785 1526.9975 1558.4251 1565.3146 1585.0443 1593.7668 2849.4941 2849.5209 2854.8489 2854.9263 2869.0980 2869.6032 3020.3463 3020.4098 3031.8541 3031.8896 3041.0704 3041.1001 3051.5622 3051.6442 3079.4758 3079.5113 3092.0304 3092.0812 3135.6623 3135.7401 3139.0124 3139.0566 3157.3587 3157.4832 3172.6030 3173.0616
redmass: 4.4085 5.7816 3.3739 5.2949 2.6695 3.3131 4.5126 4.2213 2.4637 2.7999 4.4112 3.0750 3.5515 6.8192 4.1126 6.1896 3.5661 3.6344 4.4372 4.6710 1.0902 1.0900 1.3921 1.6963 2.5283 2.8964 4.0620 4.2718 6.6511 3.1367 6.5777 3.3342 4.9949 7.8033 5.7043 3.0379 3.1708 3.7916 2.9452 3.0145 8.6636 4.1339 8.6318 5.3212 4.7668 6.6095 4.8366 7.0811 6.6045 6.6432 7.5570 2.9190 9.0141 3.4654 1.2010 1.4819 2.3152 2.1709 3.4910 3.8849 1.6683 4.7255 6.6799 1.3815 1.5026 7.7750 1.3873 1.3908 1.3757 1.3700 2.4938 2.4927 1.5699 1.5681 2.8025 2.7441 2.5738 2.1598 1.2702 1.2703 1.6749 1.5119 2.3833 2.3567 1.5334 1.5341 1.5017 1.8303 1.3816 1.5358 1.3666 1.3784 1.5778 1.5690 2.5939 2.5955 3.9605 2.9554 1.2956 1.2950 1.3358 1.3363 11.2863 10.1177 3.3838 3.6400 1.8629 1.1418 1.2923 2.4247 1.1526 1.1523 1.0916 1.0942 1.0524 1.0527 1.0613 1.0614 1.0520 1.0534 1.0926 1.0881 1.0534 1.0534 9.1120 7.2078 6.7542 6.3855 7.0256 7.5669 1.0676 1.0675 1.0577 1.0578 1.0590 1.0590 1.0731 1.0731 1.0737 1.0737 1.0882 1.0882 1.0576 1.0576 1.1008 1.1008 1.0997 1.0997 1.1074 1.1074 1.0872 1.0871 1.0931 1.0931 1.0979 1.0978
irintensity: 0.1602 0.2395 0.1150 0.1266 1.1462 0.3881 1.7990 0.1144 1.7061 2.1769 2.2838 4.2937 0.5046 0.8292 0.0015 3.9033 1.9390 5.0020 0.0650 0.0721 1.0631 1.8347 0.0453 3.3089 3.7491 8.8252 1.0158 6.2574 1.5728 1.2797 0.7977 5.0442 0.2534 7.5640 12.9905 0.1531 0.2138 5.6564 0.9661 1.5547 0.0978 4.0824 1.1782 8.1355 8.1336 2.3853 2.5407 2.7265 29.1655 35.3390 25.0928 44.6539 6.2461 0.1415 15.5742 4.3444 14.1630 26.8714 8.6295 35.3548 63.3718 0.9227 0.8552 1.4612 2.6257 35.0806 0.3715 0.1733 0.5243 2.6123 23.5906 22.7130 24.7740 31.0571 105.8206 33.2026 11.8993 4.4688 3.5373 4.9182 116.6748 50.5843 3.9544 1.6501 3.0855 5.1208 16.6879 0.3378 0.2494 24.1858 0.9910 5.3473 5.7228 5.6779 17.9540 15.9491 588.8437 1.3109 3.7879 1.6829 9.0109 7.4210 7.3322 1.8445 97.3469 3.6771 12.5581 1.2606 2.4223 3.0590 3.1479 3.9669 22.1244 3.1329 6.5634 24.0876 2.0234 11.8708 19.6072 11.9226 5.2974 24.1973 8.4204 10.2767 17.2345 148.6562 62.8705 0.0016 0.0075 6.6235 22.2576 88.8335 56.0643 62.5778 744.0730 0.0434 8.1707 72.9382 27.1594 46.7272 12.0973 14.4776 17.5924 13.8929 20.2699 40.9921 34.4868 46.7263 9.7242 10.1314 5.1698 0.9077 14.7124 0.3776 26.7008 0.4809
temp: 298.150 k
press: 1.00000 atm
elementType: 16 16 8 8 7 7 6 6 6 6 6 6 6 6 6 6 6 6 6 6 6 6 6 6 6 6 6 6 1 1 1 1 1 1 1 1 1 1 1 1 1 1 1 1 1 1 1 1 1 1 1 1 1 1
symmnumber: 1
zpe: 1132969.1 jmol-1
zpe.correction: 0.431525 hartree
zpe.thermalcorrener: 0.460659 hartree
zpe.thermalcorrenthalpy: 0.461603 hartree
zpe.thermalcorrgfe: 0.367924 hartree
zpe.sumelectzpe: -1907.906088 hartree
zpe.sumelectthermal: -1907.876954 hartree
zpe.sumelectthermalent: -1907.876010 hartree
zpe.sumelectthermalfe: -1907.969688 hartree
dipole: 0.0009 -0.0111 3.0432
dipole: 3.0432
quadrupole: -162.6619 -159.7983 -184.3292
quadrupole: 1.9541 0.0222 0.0776
quadrupole: 6.2679 9.1315 -15.3994 1.9541 0.0222 0.0776
hfenergy: -1908.3376127 hartree
pointgroup: C01 [X(C22H26N2O2S2)]
dipole: 0.0012739 -0.0028648 -1.1972732 debye
polarizability: 520.3965109|-2.028794|343.8960562|0.2804373|-0.3520759|225.8072266 unknown
InChI: InChI=1S/C22H26N2O2S2/c1-23(2)11-13-27-17-9-5-7-15-19(17)21(25)16-8-6-10-18(20(16)22(15)26)28-14-12-24(3)4/h5-10H,11-14H2,1-4H3
charge 0 multiplicity 1
54 atoms
S  4.215367 -0.928329 0.827918
S  -4.215398 0.93469 0.81813
O  2.357494 1.422236 1.207815
O  -2.357964 -1.413677 1.209322
N  5.549407 1.1223 -2.516396
N  -5.548728 -1.129646 -2.518117
C  1.295629 -0.751045 1.067184
C  -1.295836 0.759009 1.060979
C  0.038444 -1.437654 1.175186
C  -0.038843 1.446205 1.167316
C  1.286316 0.733855 1.133521
C  -1.286653 -0.725567 1.13462
C  2.498772 -1.532188 1.028607
C  -2.498966 1.5399 1.016631
C  -0.007695 -2.842003 1.319797
C  0.007089 2.851367 1.303922
C  2.423458 -2.939936 1.20294
C  -2.423899 2.948605 1.183034
C  4.15995 0.266647 -0.648307
C  -4.159375 -0.266157 -0.653443
C  1.184701 -3.590333 1.362922
C  -1.185341 3.599939 1.340844
C  5.486176 0.127832 -1.420995
C  -5.486032 -0.131445 -1.426073
C  6.408839 0.694572 -3.638572
C  5.879763 2.485977 -2.053975
C  -6.409549 -0.706782 -3.641053
C  -5.876902 -2.492233 -2.050936
H  -0.989518 -3.316658 1.401876
H  0.9888 3.326434 1.38493
H  3.351797 -3.520292 1.181228
H  -3.352222 3.528802 1.1570
H  3.993378 1.272993 -0.240091
H  3.306552 -0.012984 -1.286263
H  -3.991722 -1.270712 -0.241315
H  -3.306477 0.011773 -1.292797
H  6.351015 0.222401 -0.714444
H  5.541563 -0.883555 -1.862716
H  -6.350464 -0.224556 -0.718831
H  -5.542684 0.878409 -1.87114
H  1.153448 -4.677431 1.489526
H  -1.154273 4.687768 1.461055
H  6.069367 -0.284995 -4.018969
H  7.490648 0.605977 -3.363937
H  6.328362 1.425698 -4.463265
H  5.789883 3.193763 -2.897202
H  6.917728 2.565675 -1.641384
H  5.175327 2.808145 -1.269023
H  -6.071586 0.271922 -4.02499
H  -7.491247 -0.618602 -3.365858
H  -6.328809 -1.440591 -4.463333
H  -5.786945 -3.202626 -2.891957
H  -6.914363 -2.571921 -1.637078
H  -5.171286 -2.810979 -1.265646
