program: Gaussian 09
title: 000153419
version: EM64L-G09RevD.01
frameworkgroup: C1[X(C10H14N2O)]
method: RPBEPBE
basis: SDD
operation: Freq
keyword: #p
keyword: freq=noraman
keyword: PBEPBE/SDD
title: #p freq=noraman PBEPBE/SDD
converged: YES YES NO NO
title: Mulliken charges:
elementType: O N N C C C C C C C C C C H H H H H H H H H H H H H H
charge: -0.318818 0.017679 0.001523 0.247124 -0.697991 -0.677499 -0.679115 -0.240282 0.378545 -0.296585 -0.477699 -0.188171 -0.341083 0.241478 0.194213 0.240359 0.213353 0.240169 0.221244 0.240196 0.221985 0.212039 0.235996 0.226735 0.314017 0.229602 0.240990
chargesum: 0.00000
title: Mulliken charges with hydrogens summed into heavy atoms:
elementType: O N N C C C C C C C C C C
charge: -0.318818 0.017679 0.001523 0.247124 -0.021942 -0.002733 -0.004896 -0.004286 0.378545 -0.069850 -0.163683 0.041431 -0.100093
polarizability: 2.09317330e+02 9.89013935e+00 1.24933480e+02 2.14516375e-02 -2.08157626e-02 7.41716464e+01
1716.lowfreq: -22.1998 -9.1728 -7.7793 -0.0006 -0.0004 0.0004 7.3631 57.1257 89.2547
frequency: -21.1143 57.0853 89.2428 124.6835 151.4736 198.8699 215.8995 227.4872 239.4142 291.9098 323.8768 336.1718 379.6437 381.9200 401.9570 450.6314 500.9474 522.5656 596.7818 619.4941 644.2672 715.0451 769.4915 785.8409 820.3312 828.1123 873.4321 919.6409 921.4952 930.4240 949.5188 955.5754 981.2034 995.1543 1024.2620 1026.2169 1029.8885 1085.0750 1121.7668 1181.1396 1195.5456 1224.3110 1237.1536 1259.6630 1308.2830 1326.9166 1380.0168 1383.5300 1396.8544 1412.3678 1416.3790 1441.3594 1447.8971 1459.2798 1460.1760 1474.0512 1480.2981 1490.1692 1526.8995 1554.4418 1578.8821 2987.0793 2989.4279 3005.0297 3082.1869 3086.8569 3091.4552 3094.3014 3103.9894 3119.3799 3120.6081 3131.8819 3151.3423 3162.7789 3195.2312
redmass: 3.1127 4.3297 5.1725 4.2270 1.1159 2.3060 1.3958 2.0806 1.1487 3.1788 2.7819 3.3313 4.9304 2.4766 3.2412 2.8464 3.6352 3.2540 6.4844 6.5202 4.8510 1.8468 1.3589 4.0167 4.5159 1.7138 6.2877 1.3711 1.5842 1.5448 1.4690 1.2046 1.3901 3.8272 2.1065 1.5188 1.6532 3.4803 1.6194 2.0753 1.3120 2.2677 3.0964 2.9081 8.7003 1.2317 1.3562 1.1954 1.9916 1.2490 1.8606 2.1179 1.0481 1.0555 1.0631 1.0576 1.0596 1.0572 5.1639 5.5461 5.7069 1.0354 1.0358 1.0371 1.0999 1.0992 1.1010 1.1006 1.0987 1.0886 1.1000 1.0904 1.0890 1.0993 1.0933
irintensity: 2.9687 0.4117 0.5505 0.3927 0.3635 0.5041 0.2528 0.0490 0.2494 0.1222 0.6041 1.7034 13.9538 0.8423 2.4684 4.1875 1.4882 2.2402 0.9790 1.3443 2.6675 41.9163 0.5704 0.0216 1.9628 59.9391 6.0716 0.9733 1.2832 3.2980 9.7235 0.6076 0.1876 7.2647 0.4109 0.8604 2.6849 69.0705 12.5848 80.0018 4.2327 9.8593 18.2279 13.2851 0.7105 5.3017 52.1367 23.9385 3.6498 11.1838 29.5336 18.1485 1.2100 0.8578 1.7625 7.5867 15.5857 22.2922 18.0094 50.6995 1.7116 18.7758 18.3771 23.5494 0.0822 59.8863 10.2746 18.7121 48.7437 6.5220 21.3844 16.1455 14.7002 34.1816 0.6287
temp: 298.150 k
press: 1.00000 atm
elementType: 8 7 7 6 6 6 6 6 6 6 6 6 6 1 1 1 1 1 1 1 1 1 1 1 1 1 1
symmnumber: 1
zpe: 582844.3 jmol-1
zpe.correction: 0.221994 hartree
zpe.thermalcorrener: 0.234287 hartree
zpe.thermalcorrenthalpy: 0.235231 hartree
zpe.thermalcorrgfe: 0.183992 hartree
zpe.sumelectzpe: -573.151708 hartree
zpe.sumelectthermal: -573.139415 hartree
zpe.sumelectthermalent: -573.138471 hartree
zpe.sumelectthermalfe: -573.189710 hartree
dipole: 2.9736 -5.3822 0.0003
dipole: 6.1490
quadrupole: -69.1101 -81.4752 -79.6834
quadrupole: 5.9952 0.0049 0.0072
quadrupole: 7.6462 -4.7190 -2.9272 5.9952 0.0049 0.0072
hfenergy: -573.3737018 hartree
pointgroup: C01 [X(C10H14N2O1)]
dipole: -1.1676541 2.0632602 0.4818029 debye
polarizability: 209.2974254|10.0721085|122.5597036|-0.1022886|10.6706462|76.5653272 unknown
InChI: InChI=1S/C10H14N2O/c1-10(2,3)12(13)8-9-5-4-6-11-7-9/h4-8H,1-3H3
charge 0 multiplicity 1
27 atoms
O  -1.092991 -1.637597 -0.363931
N  -1.271294 -0.355145 -0.075785
N  3.077092 -1.261734 -0.353951
C  -2.750942 0.14454 0.062024
C  -3.673678 -1.057179 -0.211401
C  -2.956165 0.662506 1.506512
C  -2.993221 1.257596 -0.986533
C  -0.265193 0.519576 0.104899
C  1.156031 0.236579 0.017403
C  2.065255 1.3174 0.243589
C  1.732097 -1.04472 -0.280196
C  3.45134 1.097355 0.168668
C  3.915339 -0.206375 -0.133004
H  -3.489824 -1.873807 0.504444
H  -4.72295 -0.724026 -0.11698
H  -3.515197 -1.462008 -1.223636
H  -2.328814 1.542592 1.731444
H  -2.721854 -0.128241 2.240507
H  -4.012293 0.957428 1.641703
H  -2.763175 0.893058 -2.002989
H  -4.056417 1.55669 -0.959729
H  -2.386253 2.159608 -0.79463
H  -0.567151 1.543853 0.339453
H  1.67547 2.31672 0.474653
H  1.081012 -1.901233 -0.4607
H  4.163156 1.911438 0.338366
H  4.987817 -0.421877 -0.2021
